program: Gaussian 09
title: 000083442
version: EM64L-G09RevD.01
frameworkgroup: C1[X(C9H16O4)]
method: RPBEPBE
basis: SDD
operation: Freq
keyword: #pfreq=noraman
keyword: PBEPBE/SDD
title: #p freq=noraman PBEPBE/SDD
converged: YES YES NO NO
title: Mulliken charges:
elementType: O O O O C C C C C C C C C H H H H H H H H H H H H H H H H
charge: -0.280136 -0.280143 -0.246949 -0.246949 0.214843 -0.289861 -0.289841 -0.721231 -0.721295 0.295426 0.295425 -0.755965 -0.755967 0.228718 0.254277 0.228726 0.254261 0.212285 0.215016 0.239693 0.212266 0.215041 0.239727 0.246438 0.248513 0.246364 0.246450 0.248505 0.246364
chargesum: 0.00000
title: Mulliken charges with hydrogens summed into heavy atoms:
elementType: O O O O C C C C C C C C C
charge: -0.280136 -0.280143 -0.246949 -0.246949 0.214843 0.193133 0.193145 -0.054237 -0.054261 0.295426 0.295425 -0.014650 -0.014648
polarizability: 1.14330200e+02 5.04911215e-04 1.10852776e+02 3.27806113e-01 1.56506536e-03 1.05634092e+02
1716.lowfreq: -57.4585 -56.5191 -16.5211 -11.7011 -11.3462 0.0002 0.0006 0.0007 18.6855
frequency: -57.1506 -56.5149 18.6406 25.0442 41.9502 76.6600 110.4417 119.1683 149.3938 169.9467 191.7222 206.8776 219.4076 254.7398 273.4738 318.3598 319.2036 402.5515 431.2714 488.5007 489.7007 565.3413 565.5217 595.1001 611.5675 770.0314 843.2243 857.2236 896.1582 902.9875 911.6464 935.2978 956.8528 960.7326 987.9309 1000.9278 1008.8207 1031.1148 1041.0718 1041.8409 1163.3611 1179.9052 1198.0098 1211.7839 1232.4577 1268.4825 1291.6904 1349.7150 1355.4869 1373.7151 1381.4463 1381.8317 1397.2383 1452.9731 1453.1100 1454.6776 1454.8591 1455.6359 1459.5358 1466.6042 1470.1663 1477.4738 1490.5572 1651.3267 1651.6178 2978.4956 2981.7001 3006.6483 3007.4223 3007.7164 3009.7345 3069.8064 3074.0974 3081.7615 3082.5960 3089.0872 3091.7130 3095.2625 3095.3155 3142.8138 3142.8656
redmass: 1.0438 1.0347 6.5993 8.4676 4.4437 2.8937 2.5401 3.4179 1.2868 3.5577 1.5391 1.6384 4.1361 3.4866 2.8981 1.9128 2.8994 2.5583 2.4893 3.0471 3.0922 2.9992 3.0033 5.5326 4.7295 3.5190 6.0838 4.3154 1.9245 2.3888 1.8232 1.4374 3.5683 2.6031 1.4176 2.2336 2.2610 1.4947 1.6679 1.6712 1.6668 1.3808 3.2235 3.6544 2.0643 1.5399 2.3165 1.4760 1.4774 1.2033 1.2517 1.2509 1.2383 1.0624 1.0628 1.0492 1.0483 1.0606 1.0744 1.0489 1.0659 1.0590 1.0703 9.3406 9.2730 1.0357 1.0362 1.0536 1.0373 1.0414 1.0582 1.1001 1.1000 1.1069 1.1037 1.1006 1.0998 1.0974 1.0974 1.1009 1.1008
irintensity: 1.1902 1.2347 0.4692 1.9303 1.9440 1.7131 1.6571 1.7539 0.0103 1.1090 1.0239 0.6694 12.1111 18.4105 2.0279 1.0273 5.9117 0.2348 3.8260 0.0295 1.0230 3.0587 2.9786 6.3489 7.8676 1.0056 27.5869 4.3956 7.7307 1.5903 3.7083 14.2036 42.7571 55.9387 5.4807 128.1452 100.2332 1.1209 10.8682 9.5995 0.1360 1.9433 394.6394 335.9474 3.8231 1.0117 3.1583 5.8255 5.5214 19.6245 75.9359 49.5438 8.7871 5.7426 46.9220 16.0750 13.7309 10.2151 2.1160 0.1425 17.5279 9.1655 35.7734 371.4262 25.6922 19.7172 27.3128 12.6001 0.1051 15.9277 14.7467 0.4679 37.9902 5.0544 39.0699 30.0752 44.3380 9.2047 8.6894 13.2433 8.2507
temp: 298.150 k
press: 1.00000 atm
elementType: 8 8 8 8 6 6 6 6 6 6 6 6 6 1 1 1 1 1 1 1 1 1 1 1 1 1 1 1 1
symmnumber: 1
zpe: 624876.2 jmol-1
zpe.correction: 0.238003 hartree
zpe.thermalcorrener: 0.252976 hartree
zpe.thermalcorrenthalpy: 0.253920 hartree
zpe.thermalcorrgfe: 0.193651 hartree
zpe.sumelectzpe: -652.421734 hartree
zpe.sumelectthermal: -652.406761 hartree
zpe.sumelectthermalent: -652.405817 hartree
zpe.sumelectthermalfe: -652.466086 hartree
dipole: 0.0001 1.2849 0.0000
dipole: 1.2849
quadrupole: -83.1637 -72.1597 -84.1991
quadrupole: -0.0013 -16.1748 -0.0016
quadrupole: -3.3229 7.6811 -4.3583 -0.0013 -16.1748 -0.0016
hfenergy: -652.6597369 hartree
pointgroup: C01 [X(C9H16O4)]
dipole: -0.0004574 0.5054947 -0.0026018 debye
polarizability: 114.3425363|0.0023818|110.852624|-0.003823|-0.0284286|105.6219081 unknown
InChI: InChI=1S/C9H16O4/c1-7(10)12-5-9(3,4)6-13-8(2)11/h5-6H2,1-4H3
charge 0 multiplicity 1
29 atoms
O  1.691696 -0.125607 -0.37763
O  -1.697268 -0.124802 0.37869
O  3.053933 -1.071652 1.258453
O  -3.058235 -1.089337 -1.24761
C  -0.004366 1.616657 -0.008326
C  1.070531 0.739938 0.666873
C  -1.078026 0.731574 -0.6745
C  -0.637697 2.50802 1.091401
C  0.627612 2.497527 -1.117217
C  2.684222 -1.007935 0.064731
C  -2.688316 -1.01323 -0.05468
C  3.211458 -1.832757 -1.089772
C  -3.21387 -1.82745 1.108081
H  1.862166 1.360702 1.125745
H  0.630567 0.09075 1.443443
H  -1.870983 1.346482 -1.138884
H  -0.63734 0.075566 -1.444892
H  0.126113 3.155633 1.560596
H  -1.413435 3.163456 0.65496
H  -1.110801 1.895663 1.878527
H  -0.137273 3.138736 -1.593395
H  1.402114 3.159055 -0.687799
H  1.102041 1.877746 -1.897719
H  3.628087 -1.173389 -1.870835
H  2.391675 -2.410497 -1.55084
H  3.991115 -2.518388 -0.728484
H  -3.633074 -1.161119 1.881834
H  -2.392692 -2.397787 1.575816
H  -3.991256 -2.519155 0.753532
