program: Gaussian 09
title: 000083418
version: EM64L-G09RevD.01
frameworkgroup: C1[X(C8H8OS)]
method: RPBEPBE
basis: SDD
operation: Freq
keyword: #pfreq=noraman
keyword: PBEPBE/SDD
title: #p freq=noraman PBEPBE/SDD
converged: YES YES NO NO
title: Mulliken charges:
elementType: S O C C C C C C C C H H H H H H H H
charge: 0.272610 -0.223784 -0.418378 -0.451384 -0.493412 -0.378748 0.400251 0.082821 -0.212922 -0.524259 0.225975 0.216956 0.236776 0.234297 0.232011 0.250187 0.281987 0.269017
chargesum: 0.00000
title: Mulliken charges with hydrogens summed into heavy atoms:
elementType: S O C C C C C C C C
charge: 0.272610 -0.223784 0.024553 0.019689 -0.011214 -0.378748 0.400251 0.082821 0.069065 -0.255242
polarizability: 1.28857908e+02 -3.32102773e+00 1.12359114e+02 -1.32723708e+00 -2.66225819e+00 5.33228359e+01
1716.lowfreq: -12.7089 -5.8620 -0.0016 0.0011 0.0034 6.4394 90.1923 135.5466 186.9225
frequency: 90.1892 135.5457 186.9220 255.2126 289.1003 362.2647 418.7283 466.3398 475.6137 534.9953 560.5483 585.8181 660.9540 692.8323 739.9244 756.8419 846.8747 862.3148 892.8849 911.0153 919.8717 1031.0598 1050.1419 1073.2677 1105.1737 1135.1237 1170.8774 1187.1445 1238.8108 1254.9861 1313.8491 1323.8355 1350.1598 1394.3361 1438.5842 1452.7561 1470.4491 1496.4906 1540.8945 1590.9386 2962.7363 2968.1692 2998.8106 3037.4912 3060.0889 3068.8345 3191.3507 3241.1021
redmass: 3.4039 5.4226 2.9745 4.9631 2.1896 7.1841 4.0975 4.5423 3.2388 4.2840 4.8988 4.0037 3.5057 2.2832 2.7231 2.1929 1.9037 2.9046 2.0762 3.1216 1.3345 2.5238 2.0575 1.1790 2.5267 1.1780 2.0384 1.5754 1.2674 1.7777 1.4448 1.4620 1.4459 5.1563 1.1041 1.1410 1.0978 6.1788 6.4428 11.0711 1.0661 1.0668 1.0613 1.0932 1.1010 1.0961 1.0917 1.1010
irintensity: 4.4240 0.7968 1.0263 9.4008 3.7623 2.3957 0.6179 4.4832 0.6905 9.1830 0.7136 3.4061 12.4604 34.5144 23.3243 19.2506 9.7734 8.3907 23.1222 23.8438 5.5696 0.5315 0.2063 21.7064 0.6699 7.0504 1.2882 10.8203 25.9346 63.1905 3.6794 2.0190 4.1384 99.2304 7.8843 14.0558 11.2823 2.9731 14.6849 244.4949 21.0974 11.4725 34.4116 25.3341 38.4522 20.1535 2.4862 0.1475
temp: 298.150 k
press: 1.00000 atm
elementType: 16 8 6 6 6 6 6 6 6 6 1 1 1 1 1 1 1 1
symmnumber: 1
zpe: 363618.4 jmol-1
zpe.correction: 0.138495 hartree
zpe.thermalcorrener: 0.146916 hartree
zpe.thermalcorrenthalpy: 0.147860 hartree
zpe.thermalcorrgfe: 0.104903 hartree
zpe.sumelectzpe: -782.204430 hartree
zpe.sumelectthermal: -782.196009 hartree
zpe.sumelectthermalent: -782.195065 hartree
zpe.sumelectthermalfe: -782.238022 hartree
dipole: 0.9895 -3.3429 0.2072
dipole: 3.4924
quadrupole: -63.9234 -67.6674 -66.8480
quadrupole: 11.0996 -0.6985 -0.3688
quadrupole: 2.2229 -1.5212 -0.7017 11.0996 -0.6985 -0.3688
hfenergy: -782.3429252 hartree
pointgroup: C01 [X(C8H8O1S1)]
dipole: 0.220493 1.3533645 -0.0880761 debye
dipolederiv: -0.4048758 -0.0848915 -0.0011739 -0.0713195 -0.1482372 0.0048817 -0.0013065 0.0123544 0.1135666 -0.7005241 -0.1729712 0.0019366 -0.3573243 -1.0077962 0.026452 -0.0021791 0.0377946 -0.3378261 0.0867549 -0.0445445 0.0080178 0.0207907 0.0433314 -0.0202791 -0.0465003 -0.0000864 0.1420509 -0.074635 0.0131672 0.0331968 -0.0569926 0.0470308 0.0116183 0.0149608 0.0722309 0.1725162 -0.175038 0.1624591 -0.0407998 0.1674755 -0.152092 0.0318197 -0.0762174 0.0538993 0.1042965 0.6341344 0.1440489 0.0116362 0.3319402 0.3088045 -0.0159579 0.036364 -0.0896047 -0.1782977 -0.7594256 -0.3602385 -0.0067009 -0.3395203 -0.4384207 0.0128105 -0.0299412 0.0402037 0.0001343 1.4396452 0.33165 0.0413361 0.2626545 1.0846374 -0.0870443 0.0858035 -0.0900714 0.1479065 0.0009658 -0.0574724 0.0079844 -0.0987692 -0.0860827 -0.0089918 0.0124793 -0.0007791 -0.1084333 -0.1970685 0.0116516 0.0065579 -0.0109202 0.2658768 -0.0302398 0.0035585 -0.0353811 -0.3181083 0.0701638 -0.0326004 -0.037491 -0.0452265 0.0578514 0.0315929 0.0172332 -0.0145917 -0.1523101 -0.0996348 0.1389079 -0.0074318 0.1441902 -0.0660575 0.0096114 -0.0239547 0.0320418 0.0849086 0.0204075 -0.0658928 -0.0359952 -0.0340173 -0.0724994 -0.0663221 -0.0145775 -0.1122056 0.0549415 0.0092147 0.0776823 -0.0265013 0.0317999 0.0295004 0.0422295 -0.0142272 0.0825437 -0.104645 0.0874504 0.0051468 -0.0035327 0.0448404 0.0473333 0.0197238 -0.0417573 -0.0167879 -0.1099801 -0.0760026 -0.0479198 0.0547612 -0.076365 0.0291846 0.0184369 0.0952259 0.0097943 0.0786701 0.1247465 -0.0462218 0.0017488 0.0332451 0.0076386 0.0105205 -0.0026835 0.0076922 0.1898543 0.0137211 0.0280392 -0.0075492 0.0535185 0.0499965 0.0091379 -0.0122805 0.0109531 0.220755 unknown
polarizability: 127.7786839|5.2719166|113.4264674|1.3714256|-2.7493864|53.3347065 unknown
InChI: InChI=1S/C8H8OS/c9-7-2-1-3-8-6(7)4-5-10-8/h4-5H,1-3H2
charge 0 multiplicity 1
18 atoms
S  2.333256 1.161797 -0.0412
O  -1.427547 -2.199363 0.029279
C  -1.815699 1.474932 0.405679
C  -0.464386 1.984765 -0.16308
C  -2.215707 0.111017 -0.206702
C  0.556424 0.881932 -0.072667
C  0.26316 -0.483181 -0.007154
C  -1.136971 -0.968093 -0.041253
C  1.437436 -1.329416 0.071895
C  2.619851 -0.622558 0.063403
H  -1.729146 1.37231 1.504142
H  -2.60629 2.221588 0.206264
H  -0.130775 2.885895 0.383682
H  -0.596558 2.288806 -1.222837
H  -2.394982 0.230423 -1.296845
H  -3.154843 -0.272951 0.228334
H  1.368791 -2.417444 0.12942
H  3.644886 -0.984758 0.111842
