program: Gaussian 09
title: 000083422
version: EM64L-G09RevD.01
frameworkgroup: C1[X(C17H37N)]
method: RPBEPBE
basis: SDD
operation: Freq
keyword: #pfreq=noraman
keyword: PBEPBE/SDD
title: #p freq=noraman PBEPBE/SDD
converged: YES YES NO NO
title: Mulliken charges:
elementType: N C C C C C C C C C C C C C C C C C H H H H H H H H H H H H H H H H H H H H H H H H H H H H H H H H H H H H H
charge: -0.293134 -0.385947 -0.386750 -0.386749 -0.385602 -0.385616 -0.385381 -0.385148 -0.381814 -0.380434 -0.373115 -0.372064 -0.353272 -0.386888 -0.356879 -0.370861 -0.696752 -0.626725 0.193566 0.193206 0.193654 0.193237 0.193281 0.193508 0.193980 0.192985 0.193312 0.193171 0.192461 0.193511 0.192906 0.192732 0.194799 0.190891 0.191792 0.191650 0.189296 0.189192 0.190669 0.188895 0.187589 0.187446 0.179691 0.218797 0.194752 0.194644 0.175188 0.207414 0.209551 0.214754 0.209627 0.248903 0.224692 0.187313 0.220078
chargesum: 0.00000
title: Mulliken charges with hydrogens summed into heavy atoms:
elementType: N C C C C C C C C C C C C C C C C C
charge: -0.044231 0.000826 0.000140 0.000039 0.001364 0.000866 0.000591 0.000490 0.001628 0.005256 0.005373 0.007500 0.021763 0.011599 0.032517 0.011741 -0.062821 0.005359
polarizability: 2.67764415e+02 9.15607267e-01 1.66124660e+02 -1.35788638e-01 7.16944918e-01 1.55748830e+02
1716.lowfreq: -3.1832 -0.0022 0.0012 0.0019 6.7195 14.0213 15.7708 30.1139 42.3571
frequency: 14.0192 15.7491 30.5817 42.3714 49.7053 56.1874 68.5097 80.0879 81.9565 89.5129 106.5063 111.5042 122.7811 130.0185 131.9666 132.9295 148.6630 150.5944 161.9641 163.1512 187.5409 225.4196 235.2811 242.1197 252.8352 314.7995 346.1227 379.5920 424.0141 447.5100 477.9239 501.2615 511.1201 660.8409 722.0625 722.4027 723.7908 727.4358 734.9657 747.9507 767.4067 794.0965 826.9324 864.1640 886.8400 903.5178 941.9554 948.4017 974.8623 978.1384 980.4946 998.8294 1009.6614 1013.5109 1025.2005 1038.0307 1046.7933 1048.7494 1065.7685 1075.4130 1078.5830 1079.7855 1082.5370 1082.9579 1084.7855 1096.2869 1121.0501 1129.3415 1162.3208 1179.4659 1185.7766 1195.2731 1202.5678 1213.8190 1222.6258 1232.9708 1242.0447 1251.4532 1260.6241 1267.6358 1275.9595 1278.9610 1280.6570 1282.0986 1287.0091 1290.1303 1295.1275 1296.7952 1298.6406 1301.3639 1301.6137 1316.2645 1331.7153 1344.3036 1352.2959 1353.7415 1355.1714 1357.2621 1357.7094 1371.8597 1388.0705 1434.8309 1447.7726 1460.2202 1460.2805 1462.1014 1462.2972 1464.3138 1464.6289 1465.0846 1466.2966 1468.3239 1471.7615 1475.5990 1476.0835 1479.4779 1483.1538 1486.3322 1488.7119 1490.1921 1490.8023 1499.2916 2833.4749 2863.5185 2949.2361 2949.3293 2950.2181 2950.3409 2951.6026 2951.7470 2952.7819 2953.3865 2955.2913 2958.0107 2961.1695 2964.2879 2966.7812 2969.3216 2971.7490 2982.0623 2983.3170 2985.4754 2988.3424 2990.0005 2992.2501 2997.1237 3003.1882 3009.4191 3010.1863 3017.8045 3025.3396 3032.4091 3038.6063 3043.5836 3046.7580 3068.3557 3070.3962 3071.6369 3443.1921
redmass: 4.0597 4.0835 3.6845 3.8759 2.3358 1.9469 1.6393 2.7567 3.6655 1.5932 2.6991 1.6222 4.2487 2.5504 3.1247 1.8260 2.2650 1.8177 2.0990 1.9668 3.2757 1.1328 1.3226 4.3155 2.5085 3.0532 3.8309 3.0705 3.1341 3.2559 2.9326 3.0826 2.9356 1.3128 1.0579 1.0605 1.0683 1.0800 1.0966 1.1186 1.1473 1.1806 1.2094 1.2278 1.9056 1.2331 1.3464 1.9851 5.2772 4.2998 1.2019 4.6759 2.8753 1.2020 3.8837 1.0679 2.8558 3.0793 2.7880 2.5127 2.0659 2.0212 2.1148 2.2125 1.9101 1.7270 2.2335 2.3515 3.4281 1.9710 1.6708 1.4548 1.4792 1.4496 1.3951 1.3881 1.3494 1.3239 1.3214 1.2541 1.1111 1.0998 1.1955 1.0917 1.0872 1.0948 1.1252 1.1051 1.2912 1.1161 1.1113 1.3501 1.3961 1.4567 1.5780 1.6762 1.6802 1.6345 1.6349 1.5023 1.2172 1.1516 1.2001 1.0731 1.0729 1.0715 1.0706 1.0664 1.0707 1.0697 1.0699 1.0810 1.0838 1.0836 1.0435 1.0873 1.0905 1.0912 1.0878 1.0829 1.0888 1.0753 1.0713 1.0571 1.0584 1.0583 1.0588 1.0586 1.0593 1.0591 1.0594 1.0613 1.0610 1.0604 1.0599 1.0594 1.0587 1.0584 1.0368 1.0957 1.0962 1.0969 1.0979 1.0837 1.0990 1.1007 1.1022 1.0740 1.1034 1.1041 1.1045 1.1045 1.1043 1.1041 1.1035 1.1007 1.0993 1.0994 1.0744
irintensity: 0.0166 0.0446 0.1171 0.0234 0.7515 0.5426 0.6955 0.4043 0.0499 0.3896 0.5955 0.3423 0.0186 0.7867 0.0863 0.2248 0.4422 0.1153 0.1033 0.0242 0.5239 0.0007 1.6079 0.2075 1.1081 2.6149 0.1169 2.7645 1.6762 2.6629 1.2256 0.8089 0.8284 119.5585 17.9056 4.6042 10.2050 0.2010 4.7375 0.2618 1.8806 0.0988 0.5443 0.4753 4.9354 0.3525 0.5233 3.8075 0.1308 0.8959 0.5667 0.2183 0.0876 1.0301 0.1602 0.7255 2.6103 0.9472 0.9992 0.2215 1.2513 0.0463 0.1834 0.0604 2.6472 12.1039 25.5974 4.9065 27.3983 0.7188 5.9001 12.7874 11.6955 0.4390 0.5210 0.2795 1.8691 0.6921 0.6040 0.9040 0.8449 0.2775 0.1053 0.2905 0.0343 0.3871 0.0229 0.1697 0.0172 0.0157 0.0600 0.0660 0.0335 0.5621 0.2644 0.0605 0.3914 0.2587 0.0090 8.6338 11.2715 1.5086 20.7748 0.0257 0.0052 0.1256 0.0205 1.3153 0.3511 6.8492 0.8049 0.7594 1.3881 0.4757 12.2875 2.8303 0.4773 6.6102 3.5099 18.8877 39.2158 7.1407 93.1993 179.2233 0.0275 0.0132 0.0292 0.0869 0.5744 0.2710 0.5715 1.2880 3.6195 0.2128 8.7089 0.2147 248.7047 249.8542 36.0528 0.0954 0.0583 0.0896 0.0919 48.6825 1.2101 0.4035 0.2680 52.6182 0.1501 0.5366 0.7336 5.0506 5.8975 104.3453 415.2272 101.3964 56.0075 42.3970 1.8408
temp: 298.150 k
press: 1.00000 atm
elementType: 7 6 6 6 6 6 6 6 6 6 6 6 6 6 6 6 6 6 1 1 1 1 1 1 1 1 1 1 1 1 1 1 1 1 1 1 1 1 1 1 1 1 1 1 1 1 1 1 1 1 1 1 1 1 1
symmnumber: 1
zpe: 1336829.4 jmol-1
zpe.correction: 0.509171 hartree
zpe.thermalcorrener: 0.534289 hartree
zpe.thermalcorrenthalpy: 0.535234 hartree
zpe.thermalcorrgfe: 0.449974 hartree
zpe.sumelectzpe: -723.210604 hartree
zpe.sumelectthermal: -723.185486 hartree
zpe.sumelectthermalent: -723.184541 hartree
zpe.sumelectthermalfe: -723.269801 hartree
dipole: -0.0229 0.4151 -0.9915
dipole: 1.0752
quadrupole: -121.2024 -120.1575 -116.7562
quadrupole: 3.1842 -9.6979 2.2418
quadrupole: -1.8304 -0.7855 2.6158 3.1842 -9.6979 2.2418
hfenergy: -723.719775 hartree
pointgroup: C01 [X(C17H37N1)]
dipole: 0.0097224 -0.1641409 -0.3897302 debye
polarizability: 267.7579727|1.2148049|166.1277921|0.1981707|-0.7381281|155.7521391 unknown
InChI: InChI=1S/C17H37N/c1-3-4-5-6-7-8-9-10-11-12-13-14-15-16-17-18-2/h18H,3-17H2,1-2H3
charge 0 multiplicity 1
55 atoms
N  -9.597079 0.471137 0.006649
C  0.634825 0.396446 0.003768
C  -0.659136 -0.448201 -0.014608
C  1.92463 -0.454648 -0.015458
C  -1.947343 0.405121 0.004479
C  3.217253 0.392235 0.002094
C  -3.24271 -0.437327 -0.013774
C  4.508247 -0.456882 -0.017075
C  5.799721 0.391531 0.003438
C  -4.529078 0.418737 0.005957
C  7.091727 -0.456332 -0.019928
C  -5.825611 -0.421958 -0.015637
C  8.382757 0.392946 0.00365
C  -7.106965 0.440738 0.010103
C  9.675309 -0.454928 -0.021327
C  -8.400598 -0.396064 -0.012851
C  10.959296 0.40249 0.001947
C  -10.881757 -0.251311 0.002376
H  0.636717 1.043259 0.906221
H  0.636434 1.082704 -0.869058
H  -0.661103 -1.13416 0.85843
H  -0.661467 -1.095189 -0.916951
H  1.923008 -1.101935 -0.917568
H  1.924121 -1.1402 0.857874
H  -1.944428 1.052261 0.906671
H  -1.944592 1.091181 -0.868525
H  3.218175 1.039676 0.904095
H  3.217247 1.077928 -0.871183
H  -3.246481 -1.084089 -0.916303
H  -3.245735 -1.123381 0.859149
H  4.507584 -1.144092 0.85498
H  4.508585 -1.10268 -0.920298
H  -4.526481 1.063751 0.909351
H  -4.524158 1.106311 -0.865857
H  5.800668 1.035167 0.90814
H  5.798741 1.080932 -0.866918
H  7.092159 -1.147266 0.84921
H  7.092192 -1.098118 -0.92602
H  -5.828929 -1.110159 0.855428
H  -5.828978 -1.065505 -0.920393
H  8.384198 1.034085 0.910168
H  8.38334 1.084617 -0.864926
H  -7.100045 1.128286 -0.86333
H  -7.118002 1.08008 0.914138
H  9.67401 -1.14551 0.846775
H  9.672308 -1.095382 -0.92708
H  -8.379101 -1.084653 -0.898694
H  -8.435276 -1.044261 0.886372
H  10.997331 1.081505 -0.870915
H  11.868757 -0.22601 -0.018674
H  11.000887 1.027939 0.913808
H  -9.551867 1.183093 -0.734963
H  -10.97278 -0.846533 0.930394
H  -11.015756 -0.954338 -0.857874
H  -11.717272 0.471255 -0.011381
