program: Gaussian 09
title: 000083759
version: EM64L-G09RevD.01
frameworkgroup: C1[X(C24H22N4O2P2)]
method: RPBEPBE
basis: SDD
operation: Freq
keyword: #p
keyword: freq=noraman
keyword: PBEPBE/SDD
title: #p freq=noraman PBEPBE/SDD
converged: YES YES NO NO
title: Mulliken charges:
elementType: P P O O N N N N C C C C C C C C C C C C C C C C C C C C C C C C H H H H H H H H H H H H H H H H H H H H H H
charge: 1.462544 1.462566 -0.575321 -0.575335 -1.080013 -1.080211 -0.791280 -0.791169 0.561198 0.561645 0.523517 0.523471 -0.390006 -0.383326 -0.383507 -0.389863 -0.205333 -0.206941 -0.206876 -0.205462 -0.417066 -0.417077 -0.356009 -0.356007 -0.251289 -0.251391 -0.195570 -0.195571 -0.211259 -0.211263 -0.256122 -0.256112 0.346774 0.346729 0.268806 0.260137 0.260293 0.268589 0.229912 0.229996 0.230015 0.229900 0.222637 0.222663 0.298757 0.298767 0.231390 0.231380 0.227590 0.227588 0.226596 0.226596 0.229663 0.229661
chargesum: 0.00000
title: Mulliken charges with hydrogens summed into heavy atoms:
elementType: P P O O N N N N C C C C C C C C C C C C C C C C C C C C C C C C
charge: 1.462544 1.462566 -0.575321 -0.575335 -1.080013 -1.080211 -0.444506 -0.444440 0.561198 0.561645 0.523517 0.523471 -0.121200 -0.123189 -0.123214 -0.121274 0.024578 0.023055 0.023139 0.024439 -0.194429 -0.194414 -0.057252 -0.057240 -0.019899 -0.020011 0.032020 0.032017 0.015337 0.015333 -0.026458 -0.026451
polarizability: 4.39483732e+02 9.36856464e+00 3.48444981e+02 -3.30759068e+01 -1.91547955e+00 2.72245121e+02
1716.lowfreq: -9.1426 -0.0013 -0.0012 0.0010 2.9493 8.1768 14.9718 17.2752 20.3739
frequency: 14.9716 17.2611 20.3738 22.7620 26.1472 31.1478 32.3581 33.8200 51.3318 52.1768 82.4524 98.0724 116.6139 148.4691 155.6162 161.7043 177.4870 194.1043 213.0568 223.0282 223.8006 245.6708 260.5126 262.2187 315.5220 315.9380 337.7120 340.7428 390.7624 402.0312 404.3667 404.3902 406.4364 418.6298 481.4512 488.5360 492.2389 513.5478 528.7385 528.8590 552.3546 556.1152 586.3751 606.4953 609.1755 611.6796 614.0381 617.7439 653.6588 666.3646 695.9575 696.6856 697.2465 699.0598 741.1374 748.0951 757.9471 765.1707 765.9621 766.0373 781.9289 835.9212 837.5351 837.5588 842.8936 843.2373 890.8194 895.9474 907.0492 910.9023 912.8949 917.1089 921.7973 960.2301 970.4507 970.5896 973.7686 973.9702 984.2665 984.3514 984.7548 984.9056 991.5236 991.8181 993.9776 994.0136 1026.9306 1027.4479 1028.1292 1030.5803 1051.7656 1055.4946 1087.7335 1088.6461 1088.9999 1089.0598 1172.5401 1172.5429 1173.0006 1173.0577 1191.6535 1191.9453 1193.6387 1193.9577 1241.1280 1241.9273 1276.7743 1309.8261 1312.0477 1324.1166 1326.7994 1342.2338 1363.3466 1365.6191 1376.1178 1377.0385 1405.6194 1406.5193 1443.8407 1445.6291 1468.4158 1468.8255 1482.0102 1483.2776 1483.4513 1491.9767 1587.0938 1588.7109 1596.9827 1597.0455 1608.3791 1609.5047 1613.0405 1616.0559 3117.2053 3117.2106 3127.7843 3127.8412 3131.5738 3131.6419 3132.6135 3132.6361 3143.3840 3143.4387 3144.8602 3144.8715 3151.7329 3151.7792 3163.3553 3163.3793 3169.2773 3169.3547 3172.5350 3172.6065 3510.6073 3510.8168
redmass: 5.6173 5.6725 5.8561 3.9756 3.8989 4.2736 3.7465 5.0379 4.9312 5.4829 5.2123 8.6046 6.9890 5.3274 5.8504 6.2118 9.4867 4.8823 3.9222 3.8673 6.6624 5.3460 7.7141 8.5699 5.7797 5.8407 8.1108 9.4116 11.0243 3.2351 2.9267 2.9139 3.1000 5.9120 6.8219 2.1113 2.2588 3.1288 3.5809 8.6962 1.6045 1.6296 6.7962 7.1038 6.3312 6.3796 6.4896 7.3763 7.3474 6.9026 2.0100 1.9728 2.0940 1.9957 3.1545 5.7968 4.1991 1.7566 1.8476 1.7721 2.5969 3.1539 1.5561 1.2841 1.2498 1.2495 4.3768 5.4311 3.9644 1.4420 1.7052 1.4498 1.6710 7.4541 1.3603 1.3611 1.4222 1.4367 6.1623 6.1066 5.3611 5.3047 1.3115 1.3121 1.3132 1.3102 2.3525 2.2967 2.0763 2.0329 8.7948 7.8079 1.5676 1.5604 1.5733 1.5738 1.0507 1.0507 1.0493 1.0494 1.1138 1.1144 1.1185 1.1218 2.4578 2.3383 4.1810 1.5469 1.5836 1.3362 1.3344 3.5984 1.9516 2.1575 6.7462 7.1440 2.6586 2.5667 2.3820 2.3817 1.9812 1.9765 2.3592 2.3651 2.3371 2.6409 6.3585 6.4250 5.8185 5.8311 6.0259 6.0462 6.0472 6.0033 1.0879 1.0879 1.0856 1.0856 1.0885 1.0885 1.0868 1.0868 1.0925 1.0926 1.0932 1.0932 1.0968 1.0968 1.0962 1.0962 1.1016 1.1015 1.0997 1.0997 1.0754 1.0753
irintensity: 0.0142 0.0000 0.4459 0.0011 0.1235 1.2232 0.0029 0.6303 0.0004 0.0645 8.0273 0.0003 0.0000 0.0000 0.0000 9.5788 20.8104 7.8229 0.0001 4.7645 0.0019 0.0000 10.2796 0.0014 0.8580 0.3542 13.6164 0.0002 0.0003 12.3685 0.4553 0.0298 0.0000 21.8273 257.1175 0.0291 125.4343 0.0003 1.9347 0.0119 85.0045 0.0647 15.3119 0.0000 0.0001 2.5758 19.5550 0.0000 0.0000 79.3738 0.0238 74.3738 0.0099 80.1575 0.0019 23.3488 0.0022 152.3422 1.9623 76.3567 0.0002 186.0657 79.1034 6.5453 0.4655 0.0193 600.5051 0.0103 183.3967 0.0187 132.4584 0.1430 245.0711 0.0002 0.5609 0.0008 0.1891 0.0179 4.8245 0.0056 0.0034 1.8891 0.0562 7.3205 3.7249 0.0968 71.5791 0.0250 53.3343 0.0025 123.8538 0.0015 0.1951 44.3731 32.1128 0.0002 0.4726 0.3243 0.0002 0.6698 2.8243 0.1709 5.3609 0.0006 222.0294 0.0218 592.2831 178.4268 0.0002 0.0022 3.6825 0.0039 156.0339 0.0064 0.0005 1.3915 83.1420 0.0254 0.0008 5.7557 65.8237 0.1334 316.5596 0.0213 341.2071 0.0038 0.0005 10.7311 10.3824 0.1019 201.9191 0.1236 244.3528 0.0026 20.8669 1.8139 10.8130 0.6965 0.7273 2.4896 1.4808 1.3179 11.1250 5.6922 0.5791 53.6092 4.4325 32.8001 21.1834 1.6718 50.3780 0.5361 48.4545 0.1891 45.1077 0.4809
temp: 298.150 k
press: 1.00000 atm
elementType: 15 15 8 8 7 7 7 7 6 6 6 6 6 6 6 6 6 6 6 6 6 6 6 6 6 6 6 6 6 6 6 6 1 1 1 1 1 1 1 1 1 1 1 1 1 1 1 1 1 1 1 1 1 1
symmnumber: 1
zpe: 1078777.8 jmol-1
zpe.correction: 0.410885 hartree
zpe.thermalcorrener: 0.440025 hartree
zpe.thermalcorrenthalpy: 0.440969 hartree
zpe.thermalcorrgfe: 0.345172 hartree
zpe.sumelectzpe: -1977.418279 hartree
zpe.sumelectthermal: -1977.389139 hartree
zpe.sumelectthermalent: -1977.388194 hartree
zpe.sumelectthermalfe: -1977.483991 hartree
dipole: 0.0012 0.0035 0.0001
dipole: 0.0037
quadrupole: -184.9045 -188.8835 -197.5810
quadrupole: 2.1431 5.1422 -2.1408
quadrupole: 5.5518 1.5728 -7.1246 2.1431 5.1422 -2.1408
hfenergy: -1977.8291634 hartree
pointgroup: C01 [X(C24H22N4O2P2)]
dipole: -0.000758 0.00122 -0.0001443 debye
polarizability: 438.2628176|8.6803222|347.5620479|-35.2588433|-11.6204927|274.3489686 unknown
InChI: InChI=1S/C24H22N4O2P2/c29-31(25-21-13-5-1-6-14-21)27(23-17-9-3-10-18-23)32(30,26-22-15-7-2-8-16-22)28(31)24-19-11-4-12-20-24/h1-20,25-26H
charge 0 multiplicity 1
54 atoms
P  -1.131506 -0.363571 0.595003
P  1.159234 0.400209 -0.656384
O  -1.56641 -0.310291 2.125601
O  1.593706 0.347647 -2.187124
N  -0.375212 1.106252 -0.106675
N  0.403145 -1.069533 0.045375
N  -2.323184 -1.048206 -0.455482
N  2.351492 1.083747 0.3942
C  -0.867559 2.433902 -0.218808
C  0.895408 -2.397141 0.157216
C  -3.71885 -1.269351 -0.237234
C  3.747214 1.304256 0.175626
C  -1.819343 2.915927 0.717892
C  0.427875 -3.24138 1.198305
C  -0.404354 3.275902 -1.263619
C  1.851711 -2.877039 -0.775991
C  -2.31206 4.232114 0.592669
C  0.908818 -4.56471 1.290328
C  -0.884995 4.599338 -1.355886
C  2.34433 -4.19328 -0.651122
C  -4.513362 -1.583035 -1.37241
C  4.54272 1.614651 1.311007
C  -4.318483 -1.205506 1.0477
C  4.345939 1.242956 -1.109856
C  -1.844747 5.082622 -0.436407
C  1.872808 -5.04595 0.374218
C  -5.892344 -1.837316 -1.222735
C  5.921784 1.868306 1.160995
C  -5.702334 -1.45244 1.177233
C  5.729895 1.489134 -1.239741
C  -6.498247 -1.770408 0.052945
C  6.526775 1.803954 -0.115251
H  -1.984515 -1.244195 -1.40316
H  2.01317 1.279421 1.342063
H  -2.154016 2.270355 1.538033
H  -0.291255 -2.859692 1.932522
H  0.311386 2.892367 -2.000176
H  2.189871 -2.229954 -1.593514
H  -3.052606 4.597557 1.312722
H  0.539199 -5.214983 2.09087
H  -0.51868 5.247995 -2.15925
H  3.088255 -4.55698 -1.368566
H  -4.053817 -1.625514 -2.368031
H  4.083887 1.655001 2.307041
H  -3.707676 -0.974032 1.924681
H  3.734356 1.013982 -1.986952
H  -2.222994 6.106724 -0.520598
H  2.251104 -6.070045 0.458214
H  -6.492128 -2.081097 -2.106635
H  6.52234 2.109599 2.045053
H  -6.158439 -1.401224 2.17241
H  6.185308 1.439897 -2.235336
H  -7.569834 -1.963645 0.167875
H  7.59842 1.996709 -0.230456
