program: Gaussian 09
title: 000083444
version: EM64L-G09RevD.01
frameworkgroup: C1[X(C14H18N2Si)]
method: RPBEPBE
basis: SDD
operation: Freq
keyword: #p
keyword: freq=noraman
keyword: PBEPBE/SDD
title: #p freq=noraman PBEPBE/SDD
converged: YES YES NO NO
title: Mulliken charges:
elementType: Si N N C C C C C C C C C C C C C C H H H H H H H H H H H H H H H H H H
charge: 1.449542 -0.891508 -0.891229 -1.045134 -1.045018 0.517729 0.517827 -0.425838 -0.425887 -0.360746 -0.360571 -0.196429 -0.196432 -0.232153 -0.232060 -0.268658 -0.268713 0.302656 0.302511 0.265704 0.235503 0.248130 0.248138 0.265351 0.235612 0.212672 0.212581 0.250957 0.250578 0.219375 0.219356 0.218786 0.218742 0.224325 0.224303
chargesum: 0.00000
title: Mulliken charges with hydrogens summed into heavy atoms:
elementType: Si N N C C C C C C C C C C C C C C
charge: 1.449542 -0.588852 -0.588718 -0.295797 -0.295916 0.517729 0.517827 -0.213166 -0.213306 -0.109789 -0.109994 0.022945 0.022924 -0.013367 -0.013318 -0.044334 -0.044409
polarizability: 2.11426124e+02 -4.12075663e-02 1.76749935e+02 8.27510464e+00 -1.49945522e-02 1.70659684e+02
1716.lowfreq: -6.1640 -0.0017 -0.0016 -0.0015 5.7066 11.3807 21.7190 38.4153 38.9601
frequency: 21.6986 38.3176 38.9206 68.9876 87.2042 110.4552 143.7242 155.1771 164.4025 184.1550 189.1375 216.0385 227.0775 265.7605 288.7600 369.2164 378.0265 406.7063 407.6123 484.2461 496.1093 542.0932 546.6081 561.1934 565.6400 608.8246 613.7707 642.4774 693.1108 694.6312 707.7419 713.6157 734.1102 761.8342 763.3964 822.0344 822.8986 824.9450 838.6900 862.4178 863.0094 886.8007 890.6260 911.2047 925.3837 957.7257 957.8125 976.4084 976.8583 983.2701 983.8884 1026.3684 1026.4032 1083.3064 1083.6978 1168.3069 1168.3687 1187.1348 1187.7708 1256.5545 1261.4308 1301.9419 1304.3045 1308.6834 1312.8433 1356.7305 1358.4021 1407.4769 1408.1363 1445.4367 1445.8229 1456.0449 1457.8032 1468.3431 1470.8009 1485.5657 1490.7216 1592.2066 1592.2373 1616.5402 1621.3505 2988.3078 2988.8033 3089.7019 3091.3089 3097.1713 3097.3815 3106.9010 3106.9429 3122.6979 3122.9270 3135.0302 3135.0448 3146.3080 3146.6749 3164.4085 3164.5529 3513.8342 3515.0542
redmass: 5.5712 3.7178 3.6733 3.4602 3.5275 3.8462 1.3339 1.0867 2.0681 2.7761 2.8900 3.6761 3.7214 4.2890 3.4379 4.7222 4.9595 2.8903 2.9096 1.6660 1.6117 1.6477 1.8944 4.5040 5.8067 5.8701 6.3775 4.4705 1.7678 1.8249 3.0368 4.1780 2.4041 1.8649 1.7604 1.3205 1.3277 1.2800 1.7900 2.3279 3.3370 1.5643 1.5536 1.6600 2.7216 1.3840 1.3828 1.4354 1.4624 4.0956 3.8478 2.0989 2.0982 1.5651 1.5664 1.0489 1.0490 1.1079 1.1060 1.6392 1.6090 2.1810 1.2756 1.9481 1.2078 1.7768 1.7743 3.1007 3.1900 1.0572 1.0645 1.0686 1.0521 2.0501 1.9486 2.5259 2.6051 5.5571 5.5503 6.3130 6.1665 1.0351 1.0350 1.0983 1.0978 1.0979 1.0980 1.0873 1.0873 1.0856 1.0856 1.0922 1.0922 1.0946 1.0946 1.1011 1.1010 1.0744 1.0741
irintensity: 0.0675 0.2041 0.0402 0.8999 0.0720 0.5065 1.1645 0.1955 0.8281 0.1425 2.4206 1.8338 2.9507 0.5326 7.2018 11.7261 26.7341 0.2209 0.3798 46.7468 63.9077 23.4760 11.0979 0.7395 1.4459 2.2914 4.6507 26.6427 31.6668 41.9954 21.8024 3.3531 4.9511 66.6524 90.2813 0.8627 12.5432 1.7199 78.5031 3.9744 8.1211 31.5488 12.4872 206.1964 351.5941 0.0969 0.2532 4.1926 0.1751 4.5593 3.9143 21.8323 12.5525 28.7132 1.0478 0.2125 1.2359 10.1041 5.0871 28.5908 2.1963 149.9923 112.8126 113.2133 60.2229 84.1599 43.0808 33.5108 27.0597 2.4032 2.7934 2.8435 5.3204 37.7060 16.0525 210.5164 130.2243 12.2358 7.4956 191.6375 129.3160 8.4544 10.9240 1.2301 32.8779 12.7490 7.7843 14.0524 17.3555 2.6121 1.5046 13.7223 36.1776 57.0861 5.9858 26.7034 17.5644 2.3623 17.9759
temp: 298.150 k
press: 1.00000 atm
elementType: 14 7 7 6 6 6 6 6 6 6 6 6 6 6 6 6 6 1 1 1 1 1 1 1 1 1 1 1 1 1 1 1 1 1 1
symmnumber: 1
zpe: 750408.7 jmol-1
zpe.correction: 0.285816 hartree
zpe.thermalcorrener: 0.303440 hartree
zpe.thermalcorrenthalpy: 0.304384 hartree
zpe.thermalcorrgfe: 0.239106 hartree
zpe.sumelectzpe: -942.011641 hartree
zpe.sumelectthermal: -941.994017 hartree
zpe.sumelectthermalent: -941.993073 hartree
zpe.sumelectthermalfe: -942.058351 hartree
dipole: -0.0045 2.5411 0.0007
dipole: 2.5411
quadrupole: -112.6885 -106.1310 -97.3084
quadrupole: 0.0032 6.2397 0.0063
quadrupole: -7.3126 -0.7550 8.0676 0.0032 6.2397 0.0063
hfenergy: -942.2974567 hartree
pointgroup: C01[X(C14H18N2Si1)]
dipole: 0.0007044 0.9997368 -0.0072344 debye
polarizability: 210.6593888|0.1467418|176.7501813|9.9561806|-0.0101143|171.4261736 unknown
InChI: InChI=1S/C14H18N2Si/c1-17(2,15-13-9-5-3-6-10-13)16-14-11-7-4-8-12-14/h3-12,15-16H,1-2H3
charge 0 multiplicity 1
35 atoms
Si -0.002097 2.076039 -0.01419
N  1.153805 1.089145 0.935411
N  -1.160246 1.07661 -0.948134
C  0.885658 3.104303 -1.34498
C  -0.887418 3.126803 1.300667
C  2.076187 0.111426 0.493098
C  -2.079421 0.102267 -0.492168
C  3.111138 -0.338673 1.363276
C  -3.112198 -0.363823 -1.356518
C  1.998351 -0.44793 -0.815087
C  -2.000928 -0.437784 0.824082
C  4.039785 -1.309641 0.935252
C  -4.038047 -1.331459 -0.91515
C  2.937813 -1.412184 -1.234927
C  -2.937422 -1.399131 1.257055
C  3.96733 -1.851349 -0.369767
C  -3.964757 -1.854172 0.397545
H  1.240768 1.318549 1.929872
H  -1.251001 1.29481 -1.944794
H  1.524512 2.466195 -1.980935
H  0.168963 3.641897 -1.992944
H  1.538691 3.856149 -0.867036
H  -1.541409 3.870568 0.811574
H  -1.52504 2.499731 1.948797
H  -0.169085 3.674997 1.937876
H  3.184949 0.080132 2.375718
H  -3.186409 0.039868 -2.37505
H  1.178407 -0.157127 -1.480577
H  -1.182885 -0.134178 1.486164
H  4.826009 -1.640979 1.623863
H  -4.822626 -1.675354 -1.599471
H  2.855289 -1.834041 -2.243602
H  -2.854371 -1.805986 2.271828
H  4.690774 -2.603505 -0.701196
H  -4.685968 -2.603877 0.739246
