program: Gaussian 09
title: 000008113
version: EM64L-G09RevD.01
frameworkgroup: C1[X(C4H11NO2)]
method: RPBEPBE
basis: SDD
operation: Freq
keyword: #p
keyword: freq=noraman
keyword: PBEPBE/SDD
title: #p freq=noraman PBEPBE/SDD
converged: YES YES NO NO
title: Mulliken charges:
elementType: O O N C C C C H H H H H H H H H H H
charge: -0.460314 -0.439915 -0.311904 -0.342084 -0.359958 -0.320634 -0.318626 0.227149 0.205687 0.168134 0.233354 0.240674 0.176787 0.211472 0.239114 0.173011 0.347146 0.330906
chargesum: 0.00000
title: Mulliken charges with hydrogens summed into heavy atoms:
elementType: O O N C C C C
charge: -0.113168 -0.109009 -0.071230 0.090752 0.041530 0.067625 0.093500
polarizability: 7.63184262e+01 2.40984647e+00 5.33359375e+01 -1.00837393e+00 -8.12147314e-01 4.78270574e+01
1716.lowfreq: -5.8335 -0.0002 0.0005 0.0005 7.9685 20.0781 47.7917 84.6483 90.6019
frequency: 47.6491 84.6253 90.5999 126.1548 172.2507 255.4378 261.0872 302.3297 322.4048 431.7687 508.2997 687.5682 813.3178 830.7172 958.5022 972.3456 1010.3946 1023.5356 1051.7044 1063.0768 1121.3189 1155.1687 1157.0076 1206.0115 1226.9811 1266.6046 1274.8871 1291.8317 1327.6012 1357.9508 1387.5718 1418.9145 1461.0610 1472.6698 1478.3986 1486.8164 1495.0850 2819.9669 2899.0837 2928.5743 2935.5842 3003.6732 3033.1385 3044.8031 3102.3997 3428.7021 3555.9253 3578.2989
redmass: 4.5992 1.8065 4.5490 2.8569 2.5796 3.1027 1.0845 2.7724 1.5244 3.3398 4.9068 1.2602 1.1002 1.1209 4.5705 6.1675 2.4515 2.5938 1.5575 2.3551 1.4803 1.2128 3.5494 1.2967 1.3889 1.1852 1.1146 1.1909 1.2651 1.2609 1.3502 1.5131 1.2276 1.0690 1.0738 1.0951 1.0812 1.0716 1.0705 1.0618 1.0712 1.0965 1.0863 1.0935 1.0938 1.0737 1.0660 1.0666
irintensity: 1.8183 12.7961 3.2650 0.0233 16.9049 0.8493 157.9512 49.2792 134.5297 22.8728 9.2433 112.4943 2.3337 2.1499 64.0112 89.5567 81.9534 4.7074 13.3990 8.6636 1.6389 2.0569 54.0256 18.4497 20.5374 13.0383 5.1778 2.3030 16.9899 18.4402 1.7462 0.5309 25.7110 3.5954 0.5573 4.2325 5.2421 140.4257 86.1362 67.2834 85.3442 49.1148 24.2295 58.6709 28.3658 2.1423 6.2189 3.8755
temp: 298.150 k
press: 1.00000 atm
elementType: 8 8 7 6 6 6 6 1 1 1 1 1 1 1 1 1 1 1
symmnumber: 1
zpe: 406310.4 jmol-1
zpe.correction: 0.154755 hartree
zpe.thermalcorrener: 0.164160 hartree
zpe.thermalcorrenthalpy: 0.165105 hartree
zpe.thermalcorrgfe: 0.119948 hartree
zpe.sumelectzpe: -363.569448 hartree
zpe.sumelectthermal: -363.560043 hartree
zpe.sumelectthermalent: -363.559099 hartree
zpe.sumelectthermalfe: -363.604255 hartree
dipole: 1.5665 1.1494 1.9927
dipole: 2.7831
quadrupole: -48.8423 -43.4724 -42.5505
quadrupole: 8.8286 -7.4914 0.2024
quadrupole: -3.8872 1.4827 2.4046 8.8286 -7.4914 0.2024
hfenergy: -363.7242031 hartree
pointgroup: C01 [X(C4H11N1O2)]
dipole: 0.6145751 0.4435209 0.7902876 debye
dipolederiv: -0.7974327 0.2496792 -0.0135746 0.2940597 -0.2841056 -0.0730549 -0.0319933 -0.0613913 -0.5850557 -0.9154512 -0.0706635 0.0755798 -0.0980156 -0.5134999 -0.1961167 0.1145285 -0.1732059 -0.217377 -0.8513924 -0.0271209 0.009689 -0.0128707 -0.5018836 0.2153677 0.0042457 0.2177267 -0.2589104 0.4209673 -0.1742857 0.0343754 -0.2809874 0.2490709 -0.0858841 -0.0957237 -0.0786049 0.2969049 0.3662271 0.2020579 -0.0361588 0.3414272 0.2698898 -0.1270869 0.0511407 -0.1272623 0.3177875 0.6327789 -0.1843485 -0.0035557 -0.1727749 0.3128757 0.0527176 -0.0205365 0.0690197 0.4363467 0.6006905 0.1272391 -0.0124827 0.116492 0.4246964 0.0883358 -0.0411106 0.1010336 0.3123449 0.0537691 -0.0165128 -0.0473522 0.0133017 -0.016388 -0.097296 -0.0064521 -0.110492 -0.0703493 -0.0546153 0.0390913 -0.0042964 0.1109875 -0.0897953 0.1323101 -0.0702629 0.1665948 -0.1108857 -0.1073889 -0.0684284 0.030512 -0.1402988 -0.1407279 0.1476738 0.1081458 0.2043999 -0.1377896 0.0486169 0.0170131 0.0376768 -0.0196676 -0.0199701 -0.0905665 0.0134259 -0.1063187 -0.0776508 0.1144156 0.0028863 0.0024714 0.0019454 0.1955434 -0.1079082 0.0054972 -0.2001964 0.0425195 -0.0322909 0.0439749 0.006834 0.0464634 -0.1014854 -0.1324708 0.0205554 -0.1773876 -0.125595 -0.0033651 0.0445917 -0.010023 0.0488498 -0.0537351 0.1091802 -0.0027212 0.1396302 -0.1205028 0.0530831 -0.0217095 0.0007545 -0.0161134 -0.0065749 0.0830554 -0.0048878 0.1123045 -0.0480573 -0.0336707 -0.0492571 -0.0176382 -0.0208373 -0.0866135 -0.1281236 -0.02443 -0.1916842 -0.1266307 0.1350089 -0.1210606 0.0360778 -0.1620937 0.1351871 0.0453663 0.0427961 0.0417987 0.3944949 0.3700498 0.0068534 -0.0888892 -0.0498675 0.227516 0.1645009 -0.0622174 0.174035 0.0784058 unknown
polarizability: 76.26879|2.6259609|53.4074023|-1.0360276|-0.7288527|47.8052289 unknown
InChI: InChI=1S/C4H11NO2/c6-3-1-5-2-4-7/h5-7H,1-4H2
charge 0 multiplicity 1
18 atoms
O  3.668009 -0.308295 -0.023308
O  -3.710711 -0.242924 -0.107429
N  0.012948 0.369919 0.167003
C  1.268364 -0.406687 0.082927
C  -1.227278 -0.421111 0.059926
C  2.466512 0.542374 -0.029808
C  -2.452425 0.510254 -0.008054
H  1.228784 -1.039103 -0.822893
H  1.43675 -1.089082 0.95028
H  -1.366176 -1.147574 0.905748
H  -1.184697 -1.020441 -0.868418
H  0.001159 0.984904 0.993041
H  2.477088 1.246885 0.832525
H  2.383404 1.13299 -0.964611
H  -2.411817 1.124691 -0.920212
H  -2.465951 1.191022 0.873338
H  4.470801 0.251958 -0.166978
H  -3.790265 -0.839678 0.679623
