program: Gaussian 09
title: 000083378
version: EM64L-G09RevD.01
frameworkgroup: C1[X(C6H12Si)]
method: RPBEPBE
basis: SDD
operation: Freq
keyword: #pfreq=noraman
keyword: PBEPBE/SDD
title: #p freq=noraman PBEPBE/SDD
converged: YES YES NO NO
title: Mulliken charges:
elementType: Si C C C C C C H H H H H H H H H H H H
charge: 1.254383 -0.846342 -1.017449 -1.014712 -1.014696 0.225461 -0.506922 0.249211 0.249244 0.234436 0.234437 0.239232 0.232632 0.232179 0.255299 0.255304 0.232178 0.232628 0.273496
chargesum: 0.00000
title: Mulliken charges with hydrogens summed into heavy atoms:
elementType: Si C C C C C C
charge: 1.254383 -0.347886 -0.309344 -0.294602 -0.294586 0.225461 -0.233426
polarizability: 1.06446701e+02 1.08761479e+01 7.83947819e+01 -2.89152042e-03 -1.86950747e-03 7.37766467e+01
1716.lowfreq: -8.2106 -7.1595 -0.0022 -0.0012 0.0013 16.3271 49.3729 92.3544 110.6251
frequency: 48.8195 92.3535 110.5584 128.0049 134.3746 175.4988 176.6246 213.5164 214.3900 239.9150 327.6889 425.8455 574.7586 603.0065 637.3877 665.5173 693.1084 699.4563 720.9170 743.8808 811.0103 853.1394 908.7041 910.4952 922.5164 961.1349 1144.0864 1170.8019 1295.6334 1297.1789 1308.8164 1429.5186 1441.2824 1446.8213 1448.1166 1453.6098 1455.7745 1463.1554 2126.5801 2973.8280 2979.2086 2980.9193 2981.9712 3029.9920 3081.8764 3082.3349 3083.6841 3084.8472 3087.4408 3088.9491 3426.9195
redmass: 2.9197 3.1689 1.0206 1.0583 1.0209 2.3858 2.6881 2.5293 2.4661 3.3823 2.7527 6.6492 3.3463 1.3172 1.2424 3.3161 3.1124 2.9339 1.3548 1.1692 1.4210 1.4177 1.5221 1.6223 1.5753 3.6611 1.1167 1.3716 1.2017 1.2026 1.1898 1.0922 1.0536 1.0545 1.0543 1.0486 1.0485 1.0470 6.1053 1.0572 1.0345 1.0343 1.0343 1.1000 1.0986 1.0982 1.0981 1.0976 1.0986 1.0980 1.1561
irintensity: 0.1653 0.1576 0.0000 0.0149 0.0000 0.0565 0.2358 2.3448 2.2800 3.6076 7.1180 13.8659 4.1327 86.3368 71.1847 5.0541 10.6236 9.4359 0.6464 0.0001 14.6656 8.6176 80.5303 108.3350 171.9465 14.1757 5.6648 31.8012 43.4498 50.4994 12.1554 8.2507 0.0019 0.5903 0.1731 12.5376 10.0029 17.9505 33.6336 13.6790 19.8362 18.6818 6.1819 6.7575 2.5213 0.5390 25.1438 42.6721 4.2379 25.8439 70.4339
temp: 298.150 k
press: 1.00000 atm
elementType: 14 6 6 6 6 6 6 1 1 1 1 1 1 1 1 1 1 1 1
symmnumber: 1
zpe: 408859.5 jmol-1
zpe.correction: 0.155726 hartree
zpe.thermalcorrener: 0.167145 hartree
zpe.thermalcorrenthalpy: 0.168089 hartree
zpe.thermalcorrgfe: 0.119161 hartree
zpe.sumelectzpe: -524.624418 hartree
zpe.sumelectthermal: -524.613000 hartree
zpe.sumelectthermalent: -524.612056 hartree
zpe.sumelectthermalfe: -524.660983 hartree
dipole: -1.2920 -0.1090 0.0000
dipole: 1.2966
quadrupole: -52.3098 -51.0753 -52.8374
quadrupole: 2.1311 0.0010 0.0009
quadrupole: -0.2356 0.9988 -0.7632 2.1311 0.0010 0.0009
hfenergy: -524.7801448 hartree
pointgroup: C01 [X(C6H12Si1)]
dipole: -0.505764 -0.0664535 -0.0000099 debye
dipolederiv: 1.4994745 0.0548241 -0.0000355 -0.2024414 1.1846063 0.000004 -0.0001054 -0.0000304 1.2562137 -0.5322118 0.0103676 0.0000433 0.043998 -0.2376495 -0.0000642 -0.0001833 -0.0001252 -0.1495965 -0.4843147 -0.1054162 -0.0000577 -0.0381511 -0.3368531 -0.0000486 -0.0000379 -0.0000428 -0.2887356 -0.3499081 -0.0353737 -0.0062087 0.0369698 -0.338767 -0.0893126 0.0013577 -0.0840952 -0.4148828 -0.3498954 -0.0353792 0.0061981 0.0369431 -0.3390024 0.0893726 -0.0013231 0.084173 -0.4146335 0.3534284 0.1245052 0.0000121 0.4426573 0.0415614 0.0000328 0.0003773 0.0001439 -0.0782152 -0.6488399 -0.0057976 0.0000275 -0.1800499 -0.3858013 0.0000044 0.000067 0.0000292 -0.3546855 0.0565437 -0.0196861 -0.0312702 -0.0666613 -0.0020914 0.1126798 -0.0015251 0.1158041 -0.0086063 0.0564503 -0.0197622 0.0312622 -0.0666944 -0.0017954 -0.1126496 0.0014402 -0.1157988 -0.0088632 0.108053 -0.0244825 -0.0332723 -0.0225164 -0.0054991 -0.1322133 -0.0248368 -0.1253164 -0.0480013 0.1080478 -0.0245399 0.0332465 -0.0225579 -0.0058513 0.1322695 0.0248184 0.1253726 -0.0476434 -0.1362551 0.1001332 0.0000678 0.0744194 0.0564344 -0.0000266 0.0000429 -0.0000287 0.1072345 -0.0282989 0.1253664 0.0206498 0.1488352 -0.0155624 -0.0172544 0.045898 -0.0223624 0.1004758 0.1047626 -0.0028802 0.0118664 -0.0165516 0.0502388 0.0958549 0.0115862 0.1083413 -0.1098691 -0.0318737 -0.1116535 -0.0319677 -0.1300603 0.0277697 -0.0119753 -0.0542428 -0.0241608 0.104638 -0.0318495 -0.1117156 0.0317983 -0.130129 0.0277022 0.011875 0.0540551 0.024058 0.1046903 0.1047659 -0.0028506 -0.0118381 -0.0165202 0.0505078 -0.0956358 -0.011573 -0.1081296 -0.1101487 -0.0283223 0.1253933 -0.0204902 0.1488948 -0.0155833 0.0171058 -0.0457162 0.02222 0.100529 0.2302432 -0.0410524 -0.0000318 -0.0403841 0.2456357 -0.0000185 -0.000099 -0.0000521 0.2601002 unknown
polarizability: 105.3771606|12.1305125|79.4643222|-0.0028016|-0.0020018|73.7766467 unknown
InChI: InChI=1S/C6H12Si/c1-5-6-7(2,3)4/h1H,6H2,2-4H3
charge 0 multiplicity 1
19 atoms
Si -0.973247 0.03949 0.000144
C  0.592897 -1.120696 -0.000601
C  -2.522161 -1.087012 -0.000679
C  -0.922394 1.123925 1.572309
C  -0.922328 1.126063 -1.57055
C  1.851805 -0.368415 -0.000037
C  2.889229 0.303504 -0.00025
H  0.539818 -1.780336 0.888621
H  0.539796 -1.779201 -0.890674
H  -2.5450 -1.736311 -0.895584
H  -2.545071 -1.737537 0.893333
H  -3.44762 -0.481768 -0.0003
H  -1.756242 1.849942 1.583131
H  -0.996616 0.507521 2.487228
H  0.025821 1.689799 1.618904
H  0.025814 1.69213 -1.616286
H  -0.996362 0.510875 -2.486301
H  -1.756271 1.851985 -1.580507
H  3.803931 0.867141 -0.000003
