program: Gaussian 09
title: 000083354
version: EM64L-G09RevD.01
frameworkgroup: C1[X(C10H12O3)]
method: RPBEPBE
basis: SDD
operation: Freq
keyword: #pfreq=noraman
keyword: PBEPBE/SDD
title: #p freq=noraman PBEPBE/SDD
converged: YES YES NO NO
title: Mulliken charges:
elementType: O O O C C C C C C C C C C H H H H H H H H H H H H
charge: -0.252232 -0.424861 -0.192690 0.321175 0.213820 0.463601 -0.527251 -0.338337 -0.450306 -0.783776 -0.813182 -0.335156 0.159627 0.235910 0.239330 0.229244 0.243441 0.242420 0.210322 0.227975 0.222062 0.229251 0.245261 0.245238 0.389113
chargesum: 0.00000
title: Mulliken charges with hydrogens summed into heavy atoms:
elementType: O O O C C C C C C C C C C
charge: -0.252232 -0.035748 -0.192690 0.321175 0.213820 0.463601 -0.291341 -0.099006 -0.221062 -0.087592 -0.133894 0.155343 0.159627
polarizability: 1.66544798e+02 3.10941892e+00 1.25907415e+02 -6.16981796e-02 -5.66364065e-02 6.19426301e+01
1716.lowfreq: -11.9477 -6.7342 -0.0003 -0.0002 -0.0002 6.1523 26.4492 38.7809 50.5969
frequency: 26.4382 38.6788 50.5803 83.5973 114.6165 130.2578 146.7355 201.5153 210.3080 242.9728 286.0702 342.9426 404.5223 439.5278 476.1604 497.2024 512.0771 562.0548 566.7793 586.1001 628.9260 710.1668 724.8942 767.6862 801.5121 878.8315 886.6628 925.9056 929.0904 979.4830 1007.3643 1009.0178 1020.1507 1044.8854 1050.7707 1057.3287 1133.2919 1169.6696 1198.6660 1215.2120 1250.4876 1260.5309 1292.5747 1366.9595 1385.1028 1397.3869 1402.4903 1411.9608 1448.9514 1457.2872 1470.4082 1471.0265 1479.6005 1498.7328 1597.3683 1621.6313 1704.2178 2955.1899 2973.5564 2985.0914 3008.3796 3050.9829 3064.1529 3079.7056 3092.2974 3114.4336 3127.0892 3156.2284 3526.1469
redmass: 9.1131 3.8320 1.1038 5.3262 1.0814 2.3545 4.0596 2.7567 6.8299 3.6548 3.1663 4.3714 4.0532 2.8155 5.6457 4.2845 1.7395 2.9857 4.8997 4.7992 1.5020 5.6329 3.0429 5.9901 1.4247 4.0640 1.2981 3.2799 1.3556 1.5074 1.9079 4.0992 1.5441 1.5102 1.5617 2.8732 2.2784 1.5351 1.0786 2.2257 2.1339 2.1314 1.6160 2.4585 2.4819 1.2665 1.3562 2.5840 1.1238 1.0445 1.1001 1.1788 1.1679 2.0905 7.0209 6.1451 9.2512 1.0553 1.0371 1.0364 1.1032 1.0977 1.0966 1.0986 1.1007 1.0914 1.0883 1.0950 1.0643
irintensity: 0.2240 1.0333 0.1096 1.9642 0.0046 9.0724 2.8198 3.3655 0.7845 1.4531 0.1882 1.7052 4.9088 5.2363 6.4557 11.5229 37.6033 6.8292 2.2167 32.2780 132.5062 1.3187 0.1252 10.9729 53.6323 1.1225 5.7160 2.2211 0.5573 11.4163 7.1109 298.3611 25.4367 0.0325 19.0633 120.9795 69.0586 5.8519 0.3970 143.7560 49.7041 3.4830 1.4250 16.2253 4.1883 10.4577 9.6067 3.2132 70.2719 13.1959 8.6114 4.3503 16.3079 124.8709 1.0195 8.5498 210.3335 50.9551 45.9896 23.9554 17.8728 23.3340 15.6397 20.1043 19.4880 23.2977 19.0648 16.3848 34.4007
temp: 298.150 k
press: 1.00000 atm
elementType: 8 8 8 6 6 6 6 6 6 6 6 6 6 1 1 1 1 1 1 1 1 1 1 1 1
symmnumber: 1
zpe: 518632.7 jmol-1
zpe.correction: 0.197537 hartree
zpe.thermalcorrener: 0.211108 hartree
zpe.thermalcorrenthalpy: 0.212052 hartree
zpe.thermalcorrgfe: 0.155522 hartree
zpe.sumelectzpe: -612.961793 hartree
zpe.sumelectthermal: -612.948221 hartree
zpe.sumelectthermalent: -612.947277 hartree
zpe.sumelectthermalfe: -613.003808 hartree
dipole: -0.1199 -2.2509 0.0042
dipole: 2.2541
quadrupole: -62.6238 -75.5489 -78.7291
quadrupole: -7.8632 -0.0098 0.0332
quadrupole: 9.6768 -3.2483 -6.4285 -7.8632 -0.0098 0.0332
hfenergy: -613.1593293 hartree
pointgroup: C01 [X(C10H12O3)]
dipole: -0.0921835 0.8819199 0.0136041 debye
dipolederiv: -1.7792357 -0.2089374 0.0120448 -0.1786701 -0.2987202 0.0007916 0.0126418 0.0016401 -0.2568192 -0.9126183 -0.5585332 -0.0000727 -0.5444353 -0.8248634 0.0023903 0.0005664 0.0024424 -0.4386665 -0.7149923 0.2106725 0.0070918 -0.030518 -0.8898566 -0.0058307 0.0047436 -0.0087328 -0.2869425 -0.2296316 -0.0861992 0.0006646 -0.2904986 0.2725594 0.0067646 -0.0025331 0.0013298 -0.0313501 1.4972005 0.0425582 -0.0145773 -0.1106719 -0.0756219 -0.001403 -0.0174386 -0.002692 0.0507226 0.3080538 -0.0523179 -0.0024041 0.0466661 -0.12348 -0.0024643 0.0097729 -0.0020274 -0.035269 -0.0319376 0.0791817 0.0000931 0.0845675 0.0433443 0.0041081 -0.0016483 0.0049957 -0.1955354 -0.2227937 -0.0818991 -0.001126 0.2283325 -0.021341 0.000977 0.0034513 0.0044516 -0.1891972 -0.0733484 0.0967941 0.0002325 -0.1053478 0.0807543 0.0054006 -0.0037551 0.0030726 -0.1848734 -0.0103427 0.1659825 0.0050617 0.1222196 -0.0445746 -0.001628 0.0021854 0.0027422 0.0549789 -0.1035211 0.0083036 0.0013128 -0.05941 0.0836606 0.0011961 -0.0136513 0.0009622 0.0782449 0.4276839 0.2507108 0.004872 0.8195139 0.2821835 -0.0096221 0.0161506 -0.0041618 0.3910987 1.5492387 0.2015244 -0.0142272 0.2739923 1.4625942 0.0099104 -0.014678 0.0110924 0.1981133 0.0083255 -0.0951559 0.0001876 -0.107197 -0.0536872 -0.0026715 0.0003333 -0.0026389 0.1430038 0.0028548 -0.1064575 -0.0000133 -0.127408 -0.0256511 -0.0021945 -0.0001544 -0.0025758 0.1666171 0.0258291 0.089371 0.0034866 0.0899893 -0.0847035 -0.0050776 0.0038281 -0.0057612 0.1540617 0.0438834 0.0496793 0.1047485 0.0324844 0.0453471 0.0062864 0.1078238 -0.0480137 -0.0307053 0.0471809 0.0551175 -0.1015966 0.0385349 0.0388442 -0.0011712 -0.1055241 0.0528075 -0.0346975 -0.0465362 -0.1775363 -0.0064239 -0.0664934 -0.052564 -0.0052378 -0.0021753 -0.0058215 0.1045614 -0.0356007 -0.0167271 0.0569159 -0.0565269 0.0440173 0.1070262 0.1268066 0.0800273 -0.0381021 0.0476936 0.0092713 0.0015528 0.1281241 -0.1389737 -0.0166013 0.009258 -0.0133701 0.105387 -0.0456044 -0.0111212 -0.0605939 -0.040599 0.0681636 -0.0916171 -0.1319496 -0.0673461 -0.0585211 0.0252772 0.0174257 -0.02361 -0.1486848 -0.0192478 0.0786073 0.0198883 0.0921112 -0.0314008 0.0252477 0.0149819 0.0230736 -0.1495974 -0.0131028 -0.0746553 -0.0276607 -0.091826 -0.0377629 0.1976939 0.1033102 0.0033068 0.1516338 0.2449193 -0.0032839 0.0037185 -0.0027075 0.4030536 unknown
polarizability: 166.745426|-1.0116871|125.6812914|-1.051954|0.9885197|61.9681255 unknown
InChI: InChI=1S/C10H12O3/c1-7-3-4-9(8(2)5-7)13-6-10(11)12/h3-5,11H,6H2,1-2H3
charge 0 multiplicity 1
25 atoms
O  1.181562 -0.324755 0.106728
O  4.365504 1.411912 0.095787
O  3.903011 -0.872754 0.07746
C  -1.034583 -1.217141 0.115068
C  -0.208241 -0.056079 0.126353
C  -3.029864 0.265362 0.163049
C  -2.431802 -1.024645 0.133917
C  -0.76773 1.239876 0.155539
C  -2.175103 1.389686 0.1740
C  -0.407233 -2.59529 0.085793
C  -4.541409 0.41886 0.178664
C  2.070644 0.818031 0.118198
C  3.502047 0.301974 0.094578
H  -3.077971 -1.912096 0.125648
H  -0.137094 2.1343 0.164887
H  -2.604319 2.398324 0.197136
H  0.25433 -2.714034 -0.791441
H  0.231503 -2.761415 0.972672
H  -1.180844 -3.381303 0.055719
H  -4.993213 -0.112459 1.037475
H  -4.838768 1.479761 0.247003
H  -4.999183 0.00141 -0.738349
H  1.916227 1.472505 -0.764764
H  1.934486 1.439421 1.027825
H  5.309443 1.097351 0.082355
