program: Gaussian 09
title: 000083327
version: EM64L-G09RevD.01
frameworkgroup: C1[X(C10H14S)]
method: RPBEPBE
basis: SDD
operation: Freq
keyword: #pfreq=noraman
keyword: PBEPBE/SDD
title: #p freq=noraman PBEPBE/SDD
converged: YES YES NO NO
title: Mulliken charges:
elementType: S C C C C C C C C C C H H H H H H H H H H H H H H
charge: 0.160024 -0.038078 -0.648840 -0.675301 -0.686412 -0.160252 -0.268299 -0.229759 -0.208855 -0.217457 -0.233024 0.214507 0.258557 0.254930 0.202452 0.210981 0.234915 0.207354 0.218175 0.213695 0.255498 0.247770 0.229139 0.228451 0.229829
chargesum: 0.00000
title: Mulliken charges with hydrogens summed into heavy atoms:
elementType: S C C C C C C C C C C
charge: 0.160024 0.176428 -0.135353 -0.026953 -0.047188 -0.160252 -0.012801 0.018011 0.020284 0.010995 -0.003195
polarizability: 1.73630973e+02 3.54131414e+00 1.13396981e+02 1.06810248e+01 -8.36802822e+00 8.47783499e+01
1716.lowfreq: -4.7811 0.0014 0.0017 0.0028 5.7922 9.8497 14.8653 21.6482 62.7770
frequency: 14.3674 20.8762 62.7046 95.8474 176.7481 193.7299 210.4488 229.8868 264.3656 324.2014 374.6032 404.7139 410.6957 423.2923 488.2701 610.7841 677.2752 692.7737 699.1852 756.3007 812.9651 849.5051 862.4809 920.0496 922.6721 952.2022 958.9062 976.0814 986.0534 995.7144 1015.5841 1059.6003 1069.4723 1073.8877 1122.8285 1170.5738 1179.1971 1180.3562 1208.2915 1246.6921 1296.4591 1316.5923 1339.1664 1371.6855 1377.3301 1394.3669 1424.1293 1444.8416 1458.0371 1465.6981 1470.4519 1481.0432 1485.4670 1585.3131 1587.8602 2970.3752 2974.2925 2980.0404 3008.5581 3063.8372 3069.5006 3073.9309 3081.4754 3086.4215 3124.9852 3133.5118 3146.4440 3155.4398 3167.5076
redmass: 4.4667 2.6902 4.4571 2.4115 3.0951 1.0901 4.1185 1.1395 4.6808 3.3491 2.6279 2.8470 2.1576 5.1987 3.3413 6.4596 6.7230 4.0267 2.2507 1.6115 2.6866 1.2453 1.3374 1.1832 1.3828 1.7794 1.4953 1.4027 6.0372 1.3145 3.2481 1.2395 1.6215 2.3088 2.1953 1.0535 1.3565 1.4020 1.5450 1.1969 1.3307 1.4135 1.4403 9.1965 1.2069 1.2058 2.0951 1.0965 2.0821 1.0466 1.0558 1.0501 1.0534 6.2937 6.0348 1.0351 1.0377 1.0818 1.0565 1.0996 1.1004 1.0994 1.0995 1.1073 1.0846 1.0881 1.0930 1.0965 1.1014
irintensity: 0.5428 0.0966 0.3583 1.0339 0.4105 0.0524 1.5854 0.0316 0.3815 0.0350 0.1604 0.1464 0.3971 0.3190 16.2659 0.1623 12.1694 14.0420 28.7434 68.2696 2.9303 0.5242 8.8946 5.1540 2.8580 13.4551 0.2238 0.0884 3.4385 0.0925 15.2269 2.3966 8.5445 2.6760 4.4548 0.0211 11.5915 6.2186 8.0338 10.3750 0.9243 1.7653 2.5209 0.2925 21.8364 21.8713 8.9168 3.3605 31.7301 0.6642 9.3773 12.6741 22.0903 1.8118 13.0504 33.7977 27.7908 13.0511 23.0927 9.0643 38.5185 53.5196 49.2132 43.5349 0.7106 4.4366 19.7696 27.5999 18.4903
temp: 298.150 k
press: 1.00000 atm
elementType: 16 6 6 6 6 6 6 6 6 6 6 1 1 1 1 1 1 1 1 1 1 1 1 1 1
symmnumber: 1
zpe: 551651.6 jmol-1
zpe.correction: 0.210113 hartree
zpe.thermalcorrener: 0.222284 hartree
zpe.thermalcorrenthalpy: 0.223229 hartree
zpe.thermalcorrgfe: 0.169170 hartree
zpe.sumelectzpe: -786.683209 hartree
zpe.sumelectthermal: -786.671037 hartree
zpe.sumelectthermalent: -786.670093 hartree
zpe.sumelectthermalfe: -786.724152 hartree
dipole: 0.0177 1.3127 1.2663
dipole: 1.8240
quadrupole: -65.4738 -71.9254 -77.4113
quadrupole: -0.1505 1.9483 -3.9773
quadrupole: 6.1297 -0.3219 -5.8078 -0.1505 1.9483 -3.9773
hfenergy: -786.8933215 hartree
pointgroup: C01 [X(C10H14S1)]
dipole: 0.0064337 0.3775002 0.6102787 debye
dipolederiv: -0.3630175 0.0606079 0.0414119 0.1731734 -0.1430931 0.0730025 0.0572356 0.054867 -0.0594376 0.1535016 -0.0007355 -0.0100294 0.0864086 0.1233528 -0.0302248 0.2361467 -0.0495312 0.0870177 0.2072774 -0.1131625 -0.1940163 -0.2607089 0.0990505 -0.006401 -0.3188286 -0.0040788 0.1716315 -0.0141201 -0.0307037 0.0114061 -0.0368376 -0.0817207 -0.0488747 -0.0281998 -0.0567745 0.0670859 -0.1246547 0.0549305 0.0704888 -0.0074781 0.0206428 -0.0668698 -0.0508279 -0.0414312 0.0665712 0.6371685 0.0583929 0.1513457 0.0731213 -0.0174624 -0.0566096 0.2123249 -0.047396 -0.0959146 -0.2889515 0.0812687 -0.0210733 -0.0148215 0.0332909 -0.0127879 -0.0184231 0.0031312 -0.120056 -0.2435702 -0.0943486 0.0311731 -0.0642579 -0.0178708 -0.0515281 -0.0813731 -0.0631301 -0.1083976 -0.0108896 -0.0882631 0.0712353 -0.0345562 0.0530188 -0.0507472 0.0748415 -0.0683528 -0.0994749 -0.0267807 0.0837398 0.033766 0.0379438 0.0970198 -0.0333688 0.0429813 -0.0137694 -0.1271902 0.0312062 0.0367188 0.0927193 0.0235207 -0.0575215 -0.0049856 0.0689931 -0.0042395 -0.1280668 0.0601951 -0.0035201 0.0137357 -0.0116817 -0.0148024 0.0725542 -0.0349681 0.0885091 -0.1301863 -0.01123 -0.0611057 0.0241623 -0.0603316 -0.1081506 -0.0683235 0.0341566 -0.0507013 0.0169401 0.0007766 0.0312641 0.0329701 0.0688009 0.0210526 0.0596986 0.0586168 0.0395022 -0.1290886 0.0931179 0.007181 -0.0418785 -0.0113533 0.0212647 0.0624623 0.0109497 0.1264915 -0.1227789 -0.2254839 -0.0271686 -0.0729893 0.0221907 0.0788387 0.0174234 -0.0572724 0.0081606 0.0849818 0.0924829 0.0803522 0.0975663 0.0847625 -0.0076375 -0.0749876 0.0905778 -0.0961452 -0.0125213 0.1017076 0.0231335 -0.0428882 0.0070549 0.0332441 0.1218362 0.012876 0.0575669 -0.1287795 -0.2294049 0.0479233 -0.0240404 0.0311456 0.0910023 -0.0180558 -0.0395716 -0.0064247 0.0622921 0.0791582 -0.117158 -0.0019328 -0.0658751 -0.1576972 -0.0364709 0.0077401 -0.0173239 0.0732463 0.0932781 -0.0821527 -0.0169648 -0.0642637 -0.0321267 0.0178832 -0.0146825 0.0081092 0.1338029 0.0572701 0.0862706 -0.0648515 0.07232 0.0058756 0.0492571 -0.0588058 0.0515777 0.107798 0.0017982 0.079507 -0.0655758 0.0916006 -0.0344449 0.0679787 -0.0814231 0.0665712 0.1193796 0.0308889 -0.0770895 -0.0249522 -0.0998667 -0.0903684 0.0182695 -0.0249087 0.0172425 0.1459822 -0.1017242 -0.0358822 -0.0907884 -0.0400108 0.0852423 -0.0001303 -0.0981554 -0.0024304 0.125163 unknown
polarizability: 173.3928668|-0.1090286|115.6455474|12.1815733|-0.688883|82.767889 unknown
InChI: InChI=1S/C10H14S/c1-9(2)8-11-10-6-4-3-5-7-10/h3-7,9H,8H2,1-2H3
charge 0 multiplicity 1
25 atoms
S  -0.714867 -0.606019 -1.074665
C  -3.244423 0.284307 -0.109016
C  -1.753417 0.249422 0.286121
C  -3.853542 -1.134371 -0.206125
C  -4.022189 1.149363 0.915212
C  0.978418 -0.281225 -0.410306
C  1.744291 -1.356315 0.099451
C  1.52706 1.023539 -0.449971
C  3.057887 -1.124366 0.571894
C  2.834565 1.253456 0.035905
C  3.60302 0.180174 0.546229
H  -3.322537 0.771006 -1.10316
H  -1.349106 1.269731 0.403961
H  -1.600048 -0.313082 1.224133
H  -3.789688 -1.651043 0.771054
H  -4.919302 -1.082801 -0.495311
H  -3.324697 -1.754795 -0.951439
H  -3.948721 0.717268 1.931745
H  -5.093441 1.198158 0.646518
H  -3.632208 2.18352 0.953582
H  1.311143 -2.3615 0.12507
H  0.94044 1.846489 -0.873051
H  3.649138 -1.960237 0.962375
H  3.255486 2.264732 0.003988
H  4.61904 0.35899 0.915607
