program: Gaussian 09
title: 000083318
version: EM64L-G09RevD.01
frameworkgroup: C1[X(C6H11ClO2)]
method: RPBEPBE
basis: SDD
operation: Freq
keyword: #p
keyword: freq=noraman
keyword: PBEPBE/SDD
title: #p freq=noraman PBEPBE/SDD
converged: NO YES NO NO
title: Mulliken charges:
elementType: Cl O O C C C C C C H H H H H H H H H H H
charge: -0.093409 -0.244716 -0.256680 0.068209 -0.379282 -0.317471 -0.308956 -0.413981 -0.579783 0.203503 0.233689 0.202455 0.187245 0.234584 0.233127 0.189072 0.246378 0.237249 0.290602 0.268165
chargesum: 0.00000
title: Mulliken charges with hydrogens summed into heavy atoms:
elementType: Cl O O C C C C C C
charge: -0.093409 -0.244716 -0.256680 0.271712 0.056862 0.104357 0.113243 0.069645 -0.021016
polarizability: 8.98940145e+01 5.17658843e-01 6.82579524e+01 1.49856489e+00 -1.55529548e+00 7.26585925e+01
1716.lowfreq: -5.6829 -0.0026 -0.0024 -0.0019 16.0140 24.7717 54.8704 72.3255 156.6691
frequency: 54.3733 72.2665 156.6616 177.6555 250.8999 284.5722 331.0973 410.2902 443.1154 475.8496 510.4837 594.1239 600.4912 758.8260 837.1841 842.2079 883.3136 902.7727 921.5845 960.5523 980.2054 1031.1768 1050.2735 1064.6742 1117.0111 1135.0579 1155.3756 1195.9448 1214.4479 1224.1054 1263.1336 1295.1563 1316.3249 1327.4711 1342.5779 1360.1061 1363.0487 1392.4256 1433.1550 1438.3321 1447.1058 1457.8860 1470.0742 2916.4884 2938.3649 2945.2280 2999.3152 3007.5888 3068.8267 3071.4067 3086.8980 3089.6919 3094.9576 3156.2823
redmass: 4.9664 5.3512 4.2350 2.8399 2.8715 2.6043 1.7775 3.4605 4.5012 3.3163 2.6411 3.4898 3.1429 2.4592 3.2156 2.2120 1.7358 2.5985 2.5758 2.7587 2.0804 2.0566 2.1786 3.4982 2.3175 1.5068 1.3596 1.2071 1.3464 1.3629 1.1518 1.1962 1.2166 1.2151 1.4163 1.2141 1.2792 1.8071 1.0890 1.0935 1.0972 1.0863 1.0997 1.0835 1.0692 1.0691 1.0617 1.0628 1.0595 1.0994 1.0959 1.0948 1.0981 1.1114
irintensity: 1.4501 4.5553 3.4645 5.1521 2.9939 3.0644 5.7663 13.5218 8.2065 6.0837 3.0511 3.6850 21.1806 11.6773 9.1998 42.6899 21.2506 7.6734 30.1734 59.3598 21.1916 19.0264 4.4810 128.8746 52.2167 3.1261 4.7002 1.3107 22.9269 0.7250 14.6235 14.9175 1.0464 6.2817 2.9396 5.6343 9.6259 17.1616 17.1168 12.4781 15.3687 5.5456 11.9788 35.3377 26.4303 108.2387 33.3181 8.8211 20.4399 27.6823 13.6080 36.4400 33.0876 8.9167
temp: 298.150 k
press: 1.00000 atm
elementType: 17 8 8 6 6 6 6 6 6 1 1 1 1 1 1 1 1 1 1 1
symmnumber: 1
zpe: 436149.1 jmol-1
zpe.correction: 0.166120 hartree
zpe.thermalcorrener: 0.175240 hartree
zpe.thermalcorrenthalpy: 0.176184 hartree
zpe.thermalcorrgfe: 0.131006 hartree
zpe.sumelectzpe: -844.989669 hartree
zpe.sumelectthermal: -844.980550 hartree
zpe.sumelectthermalent: -844.979605 hartree
zpe.sumelectthermalfe: -845.024783 hartree
dipole: 2.6791 0.6334 0.0715
dipole: 2.7539
quadrupole: -58.9595 -63.0502 -60.0040
quadrupole: 4.1903 -7.8984 -0.6540
quadrupole: 1.7117 -2.3790 0.6673 4.1903 -7.8984 -0.6540
hfenergy: -845.1557892 hartree
pointgroup: C01 [X(C6H11Cl1O2)]
dipole: -1.0479272 0.2474847 -0.1202969 debye
dipolederiv: -0.3600814 -0.0549976 -0.1232649 -0.0595303 -0.2198045 -0.0432095 -0.2249072 -0.0901082 -0.4851873 -1.0278257 -0.1427642 0.1221692 -0.0742226 -0.592079 0.1018578 0.0790581 0.0613082 -0.434792 -0.8457932 0.2509991 -0.0057727 0.1890453 -0.8180014 0.020203 0.0058784 0.0832048 -0.4187683 0.9498123 0.0432299 0.0433012 0.0534026 0.9287675 -0.156111 0.1454887 -0.1905516 0.5171318 -0.1054149 -0.0144956 -0.0016831 -0.0061907 -0.1263726 0.0554397 0.0165763 0.0528769 0.0653155 0.5959099 -0.0230875 -0.0859626 -0.1717014 0.2634734 0.029346 -0.1412222 -0.0458422 0.4220338 0.591533 -0.1708754 -0.032154 -0.0897937 0.3574177 0.0596289 -0.1042129 0.1617681 0.3544856 -0.1540448 -0.0189631 0.0093378 -0.0431323 -0.0223682 -0.0249751 -0.0434437 -0.0491485 -0.0450979 0.3630001 0.0525179 0.2353893 0.1294783 0.1803086 0.1084232 0.3167304 0.0878777 0.6204396 0.0082215 -0.0011909 0.0209621 -0.0169741 -0.0546306 -0.045472 -0.0767343 -0.0071039 -0.1842704 0.0800234 -0.0210978 -0.0368806 -0.0372681 0.0386101 -0.0279204 -0.0935817 -0.0132766 -0.1156637 -0.125385 0.0800021 0.0860224 0.0891022 0.0527202 -0.0365803 0.1141789 -0.0432844 0.0421147 -0.0141922 0.0151593 -0.0724207 0.0674017 0.0448797 -0.0811382 0.0336968 -0.0026775 -0.2116696 -0.0660236 -0.1024297 0.0189369 -0.1055965 -0.0646381 0.0073717 -0.0050502 -0.0210999 0.0868305 0.0260665 0.0490648 -0.0025303 0.0525689 -0.1056494 0.0745763 -0.0120017 0.1128735 0.0346972 -0.0374801 0.000469 -0.0548237 -0.0025553 0.0442912 -0.0214905 0.0122655 -0.1416446 -0.1841392 0.0469228 0.0357097 -0.0047727 0.0454655 -0.0520042 0.0520689 0.010874 0.0914316 0.0870178 0.0456471 -0.0381427 -0.0892235 -0.045332 0.1066705 -0.0336168 -0.0034907 -0.0305053 -0.0674245 0.1299187 0.030497 -0.0697174 -0.0154326 -0.0462667 0.0221831 -0.0673571 0.0259383 -0.0185632 -0.1008143 0.0303956 0.0430872 0.041265 0.0846758 -0.0605847 0.0372547 -0.0420365 -0.0644902 unknown
polarizability: 89.4821609|-0.6315967|68.2060514|3.0256607|1.4336857|73.1223472 unknown
InChI: InChI=1S/C6H11ClO2/c7-3-2-6-8-4-1-5-9-6/h6H,1-5H2
charge 0 multiplicity 1
20 atoms
Cl 3.249609 0.264231 1.187056
O  -0.873525 -1.345528 -0.026592
O  -0.232226 0.914968 -0.622461
C  0.166134 -0.320184 0.061545
C  -2.593444 0.443537 -0.042716
C  -2.117629 -0.865505 0.618716
C  -1.449082 1.475674 0.006104
C  1.403783 -0.862482 -0.642144
C  2.592232 0.092898 -0.590553
H  0.35244 -0.083381 1.136681
H  -2.867096 0.246816 -1.094396
H  -3.485346 0.835895 0.48402
H  -1.926944 -0.702498 1.703364
H  -2.843204 -1.684859 0.498669
H  -1.680456 2.387978 -0.565431
H  -1.221638 1.752542 1.059993
H  1.662587 -1.840607 -0.202375
H  1.136378 -1.028378 -1.704184
H  2.315199 1.111921 -0.894301
H  3.449929 -0.27934 -1.168496
