program: Gaussian 09
title: 000083310
version: EM64L-G09RevD.01
frameworkgroup: C1[X(C16H18O4S)]
method: RPBEPBE
basis: SDD
operation: Freq
keyword: #p
keyword: freq=noraman
keyword: PBEPBE/SDD
title: #p freq=noraman PBEPBE/SDD
converged: YES YES NO NO
title: Mulliken charges:
elementType: S O O O O C C C C C C C C C C C C C C C C H H H H H H H H H H H H H H H H H H
charge: 0.850309 -0.546933 -0.539017 -0.417030 -0.417030 -0.080346 -0.080634 -0.420919 -0.427604 -0.424940 -0.417886 0.387279 0.362465 0.362412 0.387222 -0.023564 -0.023584 -0.781882 -0.858798 -0.858729 -0.781810 0.282669 0.284138 0.283045 0.281542 0.240891 0.221540 0.244183 0.259149 0.238380 0.233222 0.258968 0.233235 0.238452 0.221399 0.240924 0.244207 0.372523 0.372551
chargesum: 0.00000
title: Mulliken charges with hydrogens summed into heavy atoms:
elementType: S O O O O C C C C C C C C C C C C C C C C
charge: 0.850309 -0.546933 -0.539017 -0.044507 -0.044480 -0.080346 -0.080634 -0.138250 -0.143467 -0.141895 -0.136343 0.387279 0.362465 0.362412 0.387222 -0.023564 -0.023584 -0.075268 -0.128047 -0.128074 -0.075280
polarizability: 2.65177842e+02 6.46140958e-01 2.26801914e+02 9.10760413e-03 3.89965038e+00 1.61154425e+02
1716.lowfreq: -9.2806 -8.4112 -7.0203 -0.0015 -0.0011 -0.0001 8.6906 22.3022 26.2236
frequency: 5.8805 22.0569 26.1763 94.2305 101.6525 105.0180 105.9357 119.6660 136.0467 138.3492 148.8914 150.6214 171.8622 216.3672 218.4854 221.7495 226.7129 242.4664 275.2864 275.4957 295.2616 306.9838 328.3712 335.6002 336.7368 339.1390 342.5279 412.6695 454.6068 494.9041 500.5857 502.1801 505.3501 506.1775 520.7193 550.1396 555.0063 580.2775 584.9294 694.5513 702.1180 738.1767 739.2721 772.5084 830.7421 838.1859 891.5766 895.3769 897.1610 905.5167 910.6659 928.8476 944.2043 986.5720 987.1758 1023.0103 1023.4860 1042.8383 1043.5923 1048.0572 1048.9498 1087.8922 1096.5389 1163.5677 1166.1143 1212.8851 1215.3321 1247.0685 1250.8570 1292.1558 1294.6832 1391.6247 1392.4990 1398.2167 1398.7598 1405.6612 1406.5439 1421.6906 1424.6417 1437.4279 1441.0148 1456.7080 1457.2696 1477.5640 1477.9866 1478.2939 1478.9759 1486.5037 1487.6580 1589.2764 1590.0004 1620.8373 1623.4883 2955.4159 2955.5458 2987.1040 2987.2624 3024.7243 3024.8135 3065.4601 3065.5708 3093.1987 3093.3166 3099.1024 3099.3682 3145.4572 3147.4251 3148.6010 3150.9879 3577.6538 3578.3965
redmass: 3.5948 4.1958 6.1812 2.1750 1.0616 6.2737 1.4206 3.1246 5.3075 3.2635 1.1573 1.0790 3.5149 6.8719 6.8968 3.0384 2.7860 6.0594 3.0116 2.9833 3.6419 3.8987 6.6399 7.5447 2.5718 1.4360 1.3022 9.5440 10.2322 3.8124 3.1537 3.1700 5.3917 4.4050 5.5167 4.1017 3.9031 4.1386 4.0409 5.3749 5.3232 4.0623 4.1870 12.4263 7.2268 7.1149 1.3393 1.5631 1.3951 1.5627 2.6452 2.7567 4.1787 1.5973 1.6021 1.5607 1.5574 1.5196 1.5186 1.5259 1.5252 1.7378 1.7485 2.0683 2.0484 2.2843 2.3821 1.5081 1.4773 2.5415 2.5565 1.9350 1.7907 1.4721 1.4551 1.7251 1.8551 2.6890 2.5211 2.5811 2.5907 1.0449 1.0449 1.0443 1.0457 1.2124 1.2234 1.3563 1.3897 5.7084 5.6556 7.7064 7.7462 1.0403 1.0403 1.0367 1.0367 1.0981 1.0981 1.0969 1.0968 1.0944 1.0944 1.1003 1.1003 1.0919 1.0920 1.0923 1.0924 1.0655 1.0655
irintensity: 0.1573 0.6418 0.8541 0.7443 0.0714 2.5832 0.4461 0.1269 0.1265 0.2798 0.3144 0.2843 3.1475 13.1964 0.7830 2.5160 6.9379 0.8115 0.3180 0.0245 1.5088 11.8091 5.1244 0.4364 26.0514 79.7615 160.3648 13.7383 136.2432 2.9056 0.6149 1.2537 0.0087 1.5079 29.0250 10.3712 7.0089 54.0507 18.4126 4.4662 0.5196 6.3332 3.8944 66.6378 25.4237 45.2843 1.8356 17.5227 8.7790 14.4438 38.6522 22.3602 18.3862 2.7625 0.9029 33.9819 16.0593 2.5190 10.9015 2.4268 8.0961 181.3250 37.2786 287.5871 122.0354 4.2770 1.1584 24.4963 34.7400 3.2731 7.0805 4.0285 25.5131 46.3161 16.3403 7.6533 16.1148 50.9220 17.8778 13.9646 1.6935 10.7458 15.9271 8.0973 19.3287 31.7788 40.0904 40.5087 33.1474 9.6931 10.8295 0.0011 2.9812 31.2899 38.9457 13.8612 31.1710 13.5009 25.6114 10.6774 17.1569 7.0177 10.8862 12.8552 16.2505 2.4982 1.2903 5.8890 3.8414 51.7197 45.1287
temp: 298.150 k
press: 1.00000 atm
elementType: 16 8 8 8 8 6 6 6 6 6 6 6 6 6 6 6 6 6 6 6 6 1 1 1 1 1 1 1 1 1 1 1 1 1 1 1 1 1 1
symmnumber: 1
zpe: 789037.9 jmol-1
zpe.correction: 0.300529 hartree
zpe.thermalcorrener: 0.323333 hartree
zpe.thermalcorrenthalpy: 0.324277 hartree
zpe.thermalcorrgfe: 0.246778 hartree
zpe.sumelectzpe: -1317.764014 hartree
zpe.sumelectthermal: -1317.741210 hartree
zpe.sumelectthermalent: -1317.740265 hartree
zpe.sumelectthermalfe: -1317.817765 hartree
dipole: -0.0252 -2.6397 -7.3004
dipole: 7.7630
quadrupole: -104.4816 -119.2237 -150.3899
quadrupole: 0.1238 -0.0972 8.6981
quadrupole: 20.2168 5.4747 -25.6915 0.1238 -0.0972 8.6981
hfenergy: -1318.0645425 hartree
pointgroup: C01 [X(C16H18O4S1)]
dipole: -0.0017149 -1.2231908 -2.7985706 debye
polarizability: 265.1713741|0.8137774|227.0368227|0.0730143|-0.3939932|160.9259846 unknown
InChI: InChI=1S/C16H18O4S/c1-9-5-13(6-10(2)15(9)17)21(19,20)14-7-11(3)16(18)12(4)8-14/h5-8,17-18H,1-4H3
charge 0 multiplicity 1
39 atoms
S  -0.000685 -0.05311 1.881742
O  0.000937 -1.518133 2.622045
O  -0.00393 1.369114 2.697734
O  4.917745 0.11002 -1.636508
O  -4.910391 0.083519 -1.648888
C  1.514407 -0.024065 0.751996
C  -1.512743 -0.031322 0.748753
C  2.047059 1.221496 0.385327
C  -2.088961 -1.259336 0.398148
C  2.083008 -1.249654 0.380938
C  -2.036286 1.211157 0.359122
C  3.201195 1.260247 -0.428398
C  -3.244564 -1.258611 -0.416298
C  3.240001 -1.242352 -0.431499
C  -3.188285 1.24328 -0.457883
C  3.770499 0.018827 -0.82796
C  -3.765486 -0.001152 -0.836376
C  3.836018 2.563205 -0.861748
C  -3.927084 -2.55169 -0.825158
C  3.914035 -2.53264 -0.862614
C  -3.81315 2.542574 -0.915989
H  1.589391 2.145793 0.753784
H  -1.663077 -2.193457 0.780097
H  1.650791 -2.187832 0.745333
H  -1.57376 2.139122 0.711794
H  3.865751 2.643364 -1.963804
H  3.281807 3.427174 -0.459444
H  4.884617 2.62577 -0.518078
H  -3.394558 -3.420966 -0.407247
H  -4.970656 -2.607039 -0.454178
H  -3.948009 -2.685565 -1.925987
H  3.373755 -3.405592 -0.462689
H  3.937161 -2.645878 -1.965708
H  4.956069 -2.602976 -0.48986
H  -3.253168 3.409825 -0.529016
H  -3.841039 2.60252 -2.019369
H  -4.861665 2.619072 -0.574866
H  5.265458 -0.787722 -1.864722
H  -5.263507 -0.815787 -1.862224
