program: Gaussian 09
title: 000083286
version: EM64L-G09RevD.01
frameworkgroup: C1[X(C4F6O)]
method: RPBEPBE
basis: SDD
operation: Freq
keyword: #p
keyword: freq=noraman
keyword: PBEPBE/SDD
title: #p freq=noraman PBEPBE/SDD
converged: NO NO NO NO
title: Mulliken charges:
elementType: F F F F F F O C C C C
charge: -0.140131 -0.140191 -0.145323 -0.140511 -0.145163 -0.140687 -0.264748 0.316391 0.316368 0.241991 0.242005
chargesum: 0.00000
title: Mulliken charges with hydrogens summed into heavy atoms:
polarizability: 9.13485080e+01 3.41281784e-04 5.33372606e+01 -9.90333646e-04 6.87916152e-04 2.30523205e+01
1716.lowfreq: -162.4314 -51.0546 -11.1109 0.0008 0.0010 0.0015 2.4676 3.7050 84.4325
frequency: -162.4134 -51.0541 84.4325 128.0615 151.2505 178.1321 224.9929 283.7498 287.5267 318.2124 341.0260 439.7953 443.6323 448.5012 460.1484 540.9865 571.3320 683.4255 761.5953 1050.9678 1078.1165 1167.3583 1196.9328 1208.6050 1286.1718 1790.9944 1795.1028
redmass: 15.9315 18.7139 18.0976 18.3034 18.7645 17.0089 18.1987 13.7278 18.5777 18.0105 12.9043 17.2500 12.2689 17.1125 12.1695 16.6284 16.7627 17.3543 16.9916 13.4196 13.9689 13.1610 13.1381 13.1955 13.7215 12.1948 12.1058
irintensity: 0.6816 0.0000 0.9309 0.4381 0.0000 5.0438 1.1998 5.1687 1.3798 3.9449 0.0000 0.1668 0.0003 5.8197 0.0000 6.9741 1.0561 0.1065 57.9595 47.5060 166.3275 283.2592 0.6940 196.3757 922.5440 13.1124 1.6701
temp: 298.150 k
press: 1.00000 atm
elementType: 9 9 9 9 9 9 8 6 6 6 6
symmnumber: 1
zpe: 101210.4 jmol-1
zpe.correction: 0.038549 hartree
zpe.thermalcorrener: 0.048003 hartree
zpe.thermalcorrenthalpy: 0.048947 hartree
zpe.thermalcorrgfe: 0.003000 hartree
zpe.sumelectzpe: -825.732857 hartree
zpe.sumelectthermal: -825.723403 hartree
zpe.sumelectthermalent: -825.722459 hartree
zpe.sumelectthermalfe: -825.768406 hartree
dipole: -0.0009 -0.1478 0.0001
dipole: 0.1478
quadrupole: -64.7707 -63.8866 -55.2715
quadrupole: 0.0044 0.0001 -0.0007
quadrupole: -3.4611 -2.5770 6.0381 0.0044 0.0001 -0.0007
hfenergy: -825.7714061 hartree
pointgroup: C01 [X(C4F6O1)]
dipole: 0.0003973 0.0581386 0.0000272 debye
dipolederiv: -0.3180718 0.0412455 -0.0000407 0.0542598 -0.7933235 -0.0000795 -0.000101 -0.0000709 -0.0601975 -0.3181783 -0.0416837 0.0000463 -0.0547915 -0.7932823 0.0001342 0.0000802 0.0001153 -0.0602465 -1.0608958 0.0989826 -0.0000981 0.3130021 -0.2976754 0.000008 -0.0001042 -0.000029 -0.0650403 -0.2614755 -0.0179877 -0.0000286 -0.3442265 -0.8550475 -0.0001005 -0.0001317 -0.0001071 -0.0614436 -1.0618383 -0.0981173 0.0001133 -0.312184 -0.2971338 0.0000707 0.0001551 0.000042 -0.0648444 -0.2610611 0.0172142 0.000023 0.343235 -0.8551897 0.0001254 -0.0000075 0.000126 -0.0616356 -2.3044663 0.0010179 -0.0000003 0.0008438 -0.3793203 0.0000208 0.0000956 -0.0001301 -0.0946111 1.6673877 -0.1265751 0.0002407 -0.5143678 0.9628325 0.0001122 0.0002667 0.0001124 0.1349294 1.6679969 0.1257638 -0.0002496 0.5138157 0.9622051 -0.0001399 -0.0003579 -0.0000637 0.1349451 1.125066 -0.0731376 0.0001116 0.0293118 1.1731784 0.0000738 0.0002323 0.0001751 0.099083 1.1255365 0.0732774 -0.0001176 -0.0288983 1.1727565 -0.0002251 -0.0001278 -0.00017 0.0990617 unknown
polarizability: 91.3484977|-0.019862|53.337271|0.00099|-0.0006884|23.0523205 unknown
InChI: InChI=1S/C4F6O/c5-1(6)3(9)11-4(10)2(7)8
charge 0 multiplicity 1
11 atoms
F  -1.313865 1.749448 0.00022
F  1.315604 1.748194 -0.000253
F  -3.630909 0.161277 -0.00025
F  -2.368945 -1.759697 -0.000253
F  3.631184 0.157151 -0.000296
F  2.366756 -1.762213 0.000203
O  -0.000075 -0.248668 0.000381
C  -1.243917 0.364884 0.000149
C  1.244331 0.363635 0.000002
C  -2.369203 -0.38592 -0.000084
C  2.368939 -0.38819 -0.000021
