program: Gaussian 09
title: 000083254
version: EM64L-G09RevD.01
frameworkgroup: C1[X(C13H11NO)]
method: RPBEPBE
basis: SDD
operation: Freq
keyword: #p
keyword: freq=noraman
keyword: PBEPBE/SDD
title: #p freq=noraman PBEPBE/SDD
converged: YES YES NO NO
title: Mulliken charges:
elementType: O N C C C C C C C C C C C C C H H H H H H H H H H H
charge: -0.271647 -0.611447 0.266647 0.233265 0.106077 -0.388069 -0.364768 -0.358562 -0.411095 -0.235030 -0.236318 0.086008 -0.224002 -0.227926 -0.242052 0.251434 0.278683 0.256576 0.252554 0.231976 0.235168 0.232807 0.229814 0.232231 0.345738 0.331936
chargesum: 0.00000
title: Mulliken charges with hydrogens summed into heavy atoms:
elementType: O N C C C C C C C C C C C C C
charge: -0.271647 0.066228 0.266647 0.233265 0.106077 -0.136635 -0.086086 -0.101986 -0.158541 -0.003053 -0.001150 0.086008 0.008806 0.001888 -0.009821
polarizability: 2.06553435e+02 -8.70214588e+00 1.46869626e+02 8.40040846e+00 1.31308771e+01 8.73600066e+01
1716.lowfreq: -9.5762 -5.5834 -0.0008 -0.0008 -0.0006 6.9998 38.9244 60.6556 80.7548
frequency: 38.8006 60.6393 80.7496 104.9400 142.7169 207.6195 268.5623 288.8349 314.5461 380.9179 403.7804 407.4315 482.0952 530.4616 532.6380 562.4167 579.6966 591.8878 612.6351 616.6040 690.4230 706.2763 714.0534 752.8656 773.2916 782.6795 790.2460 857.7390 893.1018 926.4102 971.6524 979.8461 986.5421 995.2085 998.0057 1000.3093 1033.1799 1042.9943 1063.0396 1079.7211 1095.4304 1138.9615 1173.4948 1175.4083 1191.0247 1256.4936 1284.1130 1315.1326 1346.6387 1368.0327 1369.7189 1423.8351 1436.6767 1464.7806 1492.1295 1561.9358 1575.3813 1584.2324 1605.8428 1609.3635 1629.0721 3124.2850 3128.4786 3130.7805 3141.3450 3142.6182 3151.8441 3155.0420 3166.8288 3169.0983 3511.8863 3666.6430
redmass: 5.0279 5.0363 4.2835 4.3769 4.4803 4.7947 4.6295 4.7235 5.1772 5.0991 2.9876 3.2745 2.4768 1.2850 3.7467 3.0537 1.3661 4.4126 6.6993 6.3028 4.1962 1.8749 3.9659 1.8938 4.4635 2.0298 2.1458 1.2435 1.4025 1.4087 1.3895 1.3807 6.0899 6.8768 1.3149 1.3467 2.1458 2.7784 1.8350 1.6346 2.2497 1.8162 1.0534 1.0608 1.1158 1.6772 2.2165 1.3969 3.4497 5.7916 8.4402 2.3145 2.3356 2.2842 2.7583 5.0914 3.6565 4.6722 3.9065 6.0253 2.0192 1.0855 1.0857 1.0873 1.0907 1.0916 1.0965 1.0945 1.1017 1.1000 1.0451 1.1045
irintensity: 6.6700 2.3216 0.4298 2.2635 2.1414 5.5157 0.6422 1.3274 5.8302 1.3629 0.4317 2.0796 7.8225 147.8358 1.5938 28.3547 84.8095 21.3959 3.8732 2.4600 20.3934 44.8284 18.3881 87.9346 8.7541 21.7518 20.8446 0.2300 0.3587 1.9181 2.6334 0.1810 0.1196 6.6668 0.0755 1.2856 1.3386 8.2764 5.7796 7.4368 4.5513 3.7372 0.0067 0.5512 0.4987 0.1963 3.1196 1.4282 135.3063 31.0379 9.6214 11.1962 16.8936 18.4109 3.0344 54.6500 86.2048 22.6580 4.5989 4.4497 203.6926 4.5840 1.4726 0.3379 19.9965 4.8126 29.0507 12.1172 24.9099 21.0406 35.2439 43.1205
temp: 298.150 k
press: 1.00000 atm
elementType: 8 7 6 6 6 6 6 6 6 6 6 6 6 6 6 1 1 1 1 1 1 1 1 1 1 1
symmnumber: 1
zpe: 537315.3 jmol-1
zpe.correction: 0.204653 hartree
zpe.thermalcorrener: 0.216959 hartree
zpe.thermalcorrenthalpy: 0.217904 hartree
zpe.thermalcorrgfe: 0.165296 hartree
zpe.sumelectzpe: -630.944057 hartree
zpe.sumelectthermal: -630.931750 hartree
zpe.sumelectthermalent: -630.930806 hartree
zpe.sumelectthermalfe: -630.983413 hartree
dipole: -3.1126 -2.4238 -1.5024
dipole: 4.2214
quadrupole: -79.5295 -87.1129 -87.0226
quadrupole: -12.1731 0.4953 -1.1984
quadrupole: 5.0255 -2.5579 -2.4676 -12.1731 0.4953 -1.1984
hfenergy: -631.1487096 hartree
pointgroup: C01 [X(C13H11N1O1)]
dipole: -1.1142425 0.8369832 0.903459 debye
dipolederiv: -0.626508 0.0496878 0.2413887 0.2407856 -0.8831615 -0.2684763 0.2615952 -0.1234663 -0.5958795 -0.8825366 -0.1145414 0.1969139 -0.1557661 -0.5534239 0.2489124 0.1189532 0.2869234 -0.6971644 0.2601097 -0.0461266 0.019555 0.0168643 0.0524368 -0.0136908 0.0754619 0.0933844 -0.0440539 0.2732317 0.0163878 -0.0211649 0.105361 -0.0587624 0.0158518 -0.0221777 -0.0259336 -0.0031241 -0.0877369 -0.1121263 0.0127266 -0.1097702 -0.3247753 -0.0482169 -0.0516445 -0.1020953 -0.0328151 -0.2091084 -0.130939 -0.0138752 -0.1230523 -0.0402318 0.0187501 0.0072043 0.0289401 -0.1326838 -0.0565353 0.0226715 -0.0050222 -0.116333 0.0017711 0.0372583 -0.0456178 -0.0059364 -0.1051397 -0.150253 -0.053446 -0.0665652 -0.0164954 -0.0736647 0.062691 -0.0408201 0.0434308 -0.0032532 -0.1131979 0.0168815 0.0580712 -0.0116701 -0.1168111 0.0861479 0.0288279 0.0791104 0.0021537 0.0444756 0.0693137 -0.0011688 0.035951 0.1026471 0.0538675 -0.0339902 0.0385155 -0.1289833 0.0853885 0.0306125 -0.0326311 0.1113209 -0.1079267 0.0034328 -0.0100436 0.0128699 -0.1538638 1.0148043 0.2586252 -0.6229016 0.0942522 1.3069625 0.1419887 -0.559132 0.0572914 0.7092474 -0.008628 0.054353 0.0783511 0.0347112 -0.1061675 0.0893791 0.0821951 0.0962201 0.0487391 -0.0275992 -0.0306029 -0.0796935 -0.0242329 -0.1068962 0.0878757 -0.1191247 0.0877437 0.0424794 0.0609909 0.0138038 -0.0059499 0.0157379 -0.1408877 0.0364312 0.0147177 0.0434499 -0.0790655 0.0190219 0.1050174 0.0287102 0.09606 -0.0052536 -0.0241621 0.0115654 -0.0389092 0.1308082 0.0544619 0.0509978 0.0124637 0.0835972 0.0556353 -0.0252528 0.0476868 -0.0088296 0.1438363 0.0488425 0.0374056 0.0830542 0.0251252 0.1046797 -0.0629252 0.0807813 -0.0525018 0.0175023 0.0556703 -0.0472298 -0.0846013 -0.0431343 0.1033591 -0.0754305 -0.0772782 -0.0617658 0.000386 0.0456132 -0.0642604 -0.005413 -0.0930471 -0.0897703 -0.0418995 -0.0041764 -0.0424688 0.1468738 -0.1220677 -0.0510126 0.0214228 -0.0377601 0.0776213 -0.0109908 0.0230584 -0.0135788 0.1549222 0.0178521 -0.0346668 -0.0672199 -0.0550113 0.1101135 -0.0887635 -0.0881387 -0.0859907 -0.0239268 0.0044292 0.0333975 0.0812557 0.0436288 0.117813 -0.0818072 0.1022977 -0.0833571 -0.026907 -0.1375236 -0.0112842 0.001012 -0.0175072 0.147455 -0.0273312 0.0012831 -0.0275908 0.1033113 0.2318891 -0.0180517 0.0969391 -0.094313 0.2356736 -0.0744226 0.1163612 -0.1100871 0.2474753 0.2049139 -0.0448674 0.0743424 -0.0053025 0.1915645 -0.0392171 0.0801547 -0.0853683 0.2791254 unknown
polarizability: 206.2865897|8.4332332|135.31372|-12.4203971|26.0024682|99.1827572 unknown
InChI: InChI=1S/C13H11NO/c14-13(15)12-9-5-4-8-11(12)10-6-2-1-3-7-10/h1-9H,14H2
charge 0 multiplicity 1
26 atoms
O  1.866343 -2.760839 -1.01097
N  0.100987 -2.468708 0.453062
C  0.621057 0.547175 0.168335
C  -0.870967 0.407341 0.1792
C  1.528539 -0.520428 -0.12381
C  1.158961 1.844585 0.394239
C  2.917047 -0.24633 -0.236396
C  -1.561853 -0.163782 -0.925596
C  -1.633586 0.910908 1.268492
C  2.543409 2.097723 0.31309
C  3.429296 1.04757 -0.020408
C  1.165619 -1.985713 -0.286178
C  -2.971099 -0.232396 -0.937106
C  -3.044988 0.836484 1.260028
C  -3.7194 0.265433 0.156418
H  0.46678 2.669724 0.59566
H  3.576648 -1.081752 -0.49198
H  -0.98854 -0.54031 -1.779857
H  -1.114635 1.348495 2.129522
H  2.92388 3.110436 0.486194
H  4.505007 1.234312 -0.106318
H  -3.48523 -0.667941 -1.801021
H  -3.614877 1.22304 2.112308
H  -4.813619 0.211371 0.146161
H  -0.498294 -1.864527 1.013142
H  -0.127883 -3.458372 0.363692
