program: Gaussian 09
title: 000083239
version: EM64L-G09RevD.01
frameworkgroup: C1[X(C7H18NO)]
method: RPBEPBE
basis: SDD
operation: Freq
keyword: #p
keyword: freq=noraman
keyword: PBEPBE/SDD
title: #p freq=noraman PBEPBE/SDD
converged: YES YES NO NO
title: Mulliken charges:
elementType: O N C C C C C C C H H H H H H H H H H H H H H H H H H
charge: -0.439056 -0.105216 -0.317255 -0.292411 -0.297219 -0.588336 -0.346730 -0.702836 -0.703046 0.279325 0.288961 0.262935 0.264067 0.266965 0.260056 0.276224 0.270138 0.261671 0.219376 0.224478 0.271013 0.245873 0.253755 0.271857 0.246409 0.247309 0.381693
chargesum: 1.00000
title: Mulliken charges with hydrogens summed into heavy atoms:
elementType: O N C C C C C C C
charge: -0.057363 -0.105216 0.251030 0.234591 0.229803 0.219696 0.097124 0.067806 0.062529
polarizability: 9.23069254e+01 1.50237191e-01 8.60727156e+01 1.47234286e-01 -5.84687647e-01 7.24766307e+01
1716.lowfreq: -14.3965 -4.5521 -0.0008 -0.0008 -0.0006 17.0163 55.7609 63.3568 98.3987
frequency: 55.2421 62.7780 98.3663 118.1098 175.3440 210.0680 234.6150 273.9730 281.4210 285.8521 323.4158 335.7833 362.5041 372.8293 427.8290 493.5324 540.4999 696.8410 791.8127 803.3497 809.8345 844.2285 893.3590 939.0730 984.7770 1011.7574 1025.0979 1045.7660 1071.2881 1076.6396 1113.2513 1127.7909 1166.3064 1186.9704 1201.4827 1222.3842 1232.1754 1293.5672 1295.9374 1314.7028 1353.1731 1363.7941 1378.2046 1413.9202 1418.7969 1426.8318 1439.2563 1459.4764 1462.8724 1470.1649 1479.3553 1484.9729 1485.9517 1489.0401 1493.4283 1497.5456 1500.8512 2958.4699 3009.7557 3010.1558 3014.0627 3027.4817 3031.7889 3037.9370 3046.1850 3091.6603 3096.6367 3097.2246 3101.0685 3122.3618 3124.5171 3127.2118 3150.3615 3157.2185 3590.5308
redmass: 2.2847 2.4221 2.1318 2.0320 2.2519 1.2277 2.5928 1.1082 1.2657 1.1726 2.3622 3.2703 2.3903 2.6151 2.2841 2.7100 2.9272 3.2461 1.3471 1.1877 1.3476 1.7801 2.3365 2.5625 4.4368 2.0278 2.1328 2.9021 1.6286 1.5670 1.6699 1.7776 1.5129 1.7028 1.8618 1.2681 1.3299 1.1303 1.1215 1.1799 1.2795 1.2711 1.3254 1.1990 1.2088 1.3367 1.1524 1.0702 1.0618 1.0594 1.0640 1.0498 1.0498 1.0596 1.0742 1.0674 1.0512 1.0563 1.0379 1.0383 1.1029 1.0626 1.0612 1.0340 1.0598 1.1051 1.0981 1.0975 1.1025 1.1030 1.1060 1.1037 1.1044 1.1046 1.0674
irintensity: 13.7969 3.0160 0.4025 0.8478 3.3937 0.0125 0.9207 140.1328 3.3068 24.0128 8.5801 9.1344 0.7909 1.5452 1.8579 3.1644 6.2964 2.4161 15.2205 15.7836 11.7597 5.1848 36.0037 48.9001 34.5111 37.0546 15.4761 1.9230 1.3766 0.9085 10.7185 4.5869 2.2764 6.4795 3.7130 34.7503 0.1749 3.5577 5.7786 8.9692 3.8058 1.0877 3.1272 13.8737 45.1628 2.9795 31.5170 5.3481 3.9151 12.4786 44.0781 15.2374 15.6951 16.9261 26.4784 17.3835 6.4985 51.4751 2.5666 3.7348 30.3416 13.3766 8.7907 3.2310 3.6143 0.4670 6.6700 6.2478 0.2374 23.0878 14.1074 8.3737 5.8337 4.0810 36.8760
temp: 298.150 k
press: 1.00000 atm
elementType: 8 7 6 6 6 6 6 6 6 1 1 1 1 1 1 1 1 1 1 1 1 1 1 1 1 1 1
symmnumber: 1
zpe: 653237.7 jmol-1
zpe.correction: 0.248805 hartree
zpe.thermalcorrener: 0.260838 hartree
zpe.thermalcorrenthalpy: 0.261782 hartree
zpe.thermalcorrgfe: 0.211383 hartree
zpe.sumelectzpe: -406.469439 hartree
zpe.sumelectthermal: -406.457406 hartree
zpe.sumelectthermalent: -406.456462 hartree
zpe.sumelectthermalfe: -406.506862 hartree
dipole: -1.9074 -1.7052 0.6388
dipole: 2.6370
quadrupole: -40.1651 -44.5111 -50.3853
quadrupole: -6.6016 1.7653 0.1682
quadrupole: 4.8554 0.5094 -5.3648 -6.6016 1.7653 0.1682
hfenergy: -406.7182444 hartree
pointgroup: C01 [X(C7H18N1O1)]
dipole: 0.6868753 -0.7178735 -0.2987497 debye
polarizability: 92.2111268|-0.5301203|86.109984|-0.9781317|0.7309962|72.535161 unknown
InChI: InChI=1S/C7H18NO/c1-4-8(3,5-2)6-7-9/h9H,4-7H2,1-3H3
charge 1 multiplicity 1
27 atoms
O  -3.267258 0.305471 0.419136
N  0.443471 0.002556 -0.086077
C  -0.951805 0.414806 0.42142
C  1.490312 1.005533 0.484649
C  0.769943 -1.425091 0.444062
C  0.484807 0.021499 -1.612829
C  -2.119296 -0.514836 0.039982
C  1.274678 2.471922 0.094267
C  2.158697 -1.964128 0.083642
H  -0.889472 0.501833 1.519285
H  -1.175383 1.409116 0.004629
H  1.45793 0.878555 1.581136
H  2.469518 0.654101 0.122923
H  0.635504 -1.374424 1.539126
H  -0.010568 -2.084643 0.029552
H  0.004651 0.941024 -1.976278
H  1.530841 -0.007918 -1.949428
H  -0.052317 -0.853812 -2.006201
H  -2.127409 -0.741521 -1.046773
H  -2.094046 -1.466272 0.607813
H  2.113706 3.052796 0.516564
H  1.29517 2.633021 -0.996475
H  0.349255 2.903919 0.507385
H  2.215537 -3.004925 0.448734
H  2.336666 -1.999248 -1.004264
H  2.981591 -1.413913 0.567485
H  -4.109125 -0.21182 0.367038
