program: Gaussian 09
title: 000083229
version: EM64L-G09RevD.01
frameworkgroup: C1[X(C6H14N2O3)]
method: RPBEPBE
basis: SDD
operation: Freq
keyword: #p
keyword: freq=noraman
keyword: PBEPBE/SDD
title: #p freq=noraman PBEPBE/SDD
converged: YES YES NO NO
title: Mulliken charges:
elementType: O O O N N C C C C C C H H H H H H H H H H H H H H
charge: -0.441972 -0.414324 -0.236727 -0.585181 -0.586443 -0.429321 -0.379659 -0.016689 -0.170389 -0.466383 0.172305 0.204617 0.213461 0.202827 0.231098 0.230384 0.239727 0.238396 0.177527 0.293901 0.268819 0.320752 0.285509 0.273143 0.374624
chargesum: 0.00000
title: Mulliken charges with hydrogens summed into heavy atoms:
elementType: O O O N N C C C C C C
charge: -0.121220 -0.039700 -0.236727 -0.022462 -0.027791 -0.011244 0.054265 0.213696 0.069338 -0.050460 0.172305
polarizability: 9.78560575e+01 5.10237197e+00 8.52362751e+01 -5.54769456e+00 8.88507583e-01 8.23680185e+01
1716.lowfreq: -10.3380 -0.0005 -0.0004 0.0006 6.1579 11.4352 23.3540 34.6932 63.7771
frequency: 23.0808 34.5658 63.7317 86.1053 125.2002 141.7394 177.7989 196.3743 211.9460 236.9501 290.6471 291.6108 308.0082 340.3278 424.6152 429.1996 484.0093 509.7584 553.7013 593.3698 604.7240 631.7671 718.5190 752.2102 792.5419 826.8119 906.0039 977.6732 1013.4790 1017.5570 1045.3907 1055.6111 1071.7871 1098.1139 1113.1910 1131.8833 1157.7135 1177.8843 1232.0823 1253.0508 1262.9492 1286.9240 1313.0038 1315.3827 1316.5017 1350.9575 1360.3287 1369.6176 1401.9076 1449.4597 1465.1764 1465.8938 1615.4355 1646.4384 1672.6015 2862.5339 2957.3418 2978.7012 3017.0973 3025.8575 3046.9494 3055.5647 3064.3607 3458.8480 3495.5498 3502.7548 3532.0331 3594.1055 3629.8869
redmass: 5.8170 6.3490 4.2085 4.7919 2.1367 2.3106 1.2347 2.8868 2.3480 1.5071 2.3833 1.7099 1.7061 3.2021 3.5541 3.8442 2.4887 2.2322 1.4913 2.0048 2.0528 1.3034 3.2176 2.1049 2.3349 1.5992 1.8060 4.0558 2.1765 1.6356 3.5245 2.9387 2.7780 1.3943 1.8659 2.1702 1.5123 1.6313 1.4789 1.4176 1.4802 1.2032 1.1534 1.2452 1.2356 1.3393 1.4243 1.3913 1.7696 1.0789 1.0830 1.0992 1.3089 1.0940 3.6409 1.0710 1.0617 1.0611 1.0929 1.0884 1.0875 1.0982 1.0930 1.0447 1.0637 1.0453 1.0656 1.0981 1.0993
irintensity: 0.8208 3.8674 0.2249 2.7939 0.2215 13.5961 38.3312 5.6371 5.2097 46.7285 16.5666 64.9111 84.2027 3.3905 17.3375 24.8874 52.7960 18.1934 275.9016 39.8467 10.5218 345.2016 34.0912 7.5929 2.6055 5.3161 36.2947 52.7274 17.8723 1.7590 66.5566 197.3237 17.3314 1.2799 37.8617 2.8319 1.3134 11.1818 10.5989 4.6396 7.1258 8.7375 3.2233 2.9759 3.3534 32.4072 23.2370 9.8624 9.9406 2.9094 4.8145 15.8115 145.0274 50.5738 128.6775 96.0326 15.5192 33.1357 12.7211 6.7795 14.9005 32.1553 65.0943 5.7200 17.0810 0.5252 4.2920 6.5408 3.0208
temp: 298.150 k
press: 1.00000 atm
elementType: 8 8 8 7 7 6 6 6 6 6 6 1 1 1 1 1 1 1 1 1 1 1 1 1 1
symmnumber: 1
zpe: 547978.8 jmol-1
zpe.correction: 0.208714 hartree
zpe.thermalcorrener: 0.222602 hartree
zpe.thermalcorrenthalpy: 0.223546 hartree
zpe.thermalcorrgfe: 0.166965 hartree
zpe.sumelectzpe: -571.283783 hartree
zpe.sumelectthermal: -571.269895 hartree
zpe.sumelectthermalent: -571.268951 hartree
zpe.sumelectthermalfe: -571.325532 hartree
dipole: 2.4054 2.4783 -0.1843
dipole: 3.4586
quadrupole: -72.0926 -62.7294 -66.9507
quadrupole: 7.0835 0.6390 6.8415
quadrupole: -4.8350 4.5281 0.3069 7.0835 0.6390 6.8415
hfenergy: -571.4924974 hartree
pointgroup: C01 [X(C6H14N2O3)]
dipole: 0.9089768 -1.0104265 0.0656687 debye
dipolederiv: -0.7101312 0.0990475 0.0818948 0.0853765 -0.4006018 0.3248446 0.1093331 0.3515768 -0.53488 -0.4350025 0.1274117 0.0371279 0.1496585 -1.1598453 0.1461309 0.0645769 0.0462941 -0.2471471 -0.5462395 0.1705469 -0.2207986 0.046822 -0.6459846 -0.0338567 -0.3728979 0.1717992 -0.7011968 -0.9111799 0.0074619 0.2443629 0.0218473 -0.4370491 0.042242 0.3083713 -0.0362591 -0.3741999 -0.3411231 0.1824096 0.0200151 0.2013178 -0.5369315 -0.0476376 -0.0772404 -0.0155789 -0.8144101 -0.2213352 -0.0021794 0.1179595 -0.0417449 -0.0180613 0.0886484 0.0661355 0.0230887 0.0909917 -0.0141307 0.1092995 0.1159175 -0.0650019 0.0462713 0.018418 0.0101289 -0.0411873 0.0629112 0.4502642 0.0184877 -0.0493593 0.1024537 0.3196458 -0.1767662 -0.0254278 -0.2012543 0.4933539 0.3798719 -0.1565309 -0.238692 -0.2081017 0.2667309 -0.0487989 -0.217441 -0.0858147 0.1449644 0.1217244 -0.0421251 0.1475897 -0.143831 0.3300529 -0.0831256 0.1908638 -0.0493672 0.5041863 0.5677509 -0.2500218 0.3744083 -0.1333129 1.422812 -0.0030068 0.5943431 -0.0650739 0.7949193 0.0464321 -0.0181339 -0.006561 -0.0021209 -0.0215571 -0.1030407 -0.0473842 -0.1265003 -0.0881818 0.1027621 -0.0110215 0.0101504 0.0277708 -0.019679 0.0941033 -0.0106571 0.1198843 -0.0633932 0.0048935 -0.0562444 -0.0587402 -0.0314646 -0.0324008 -0.1148163 -0.014885 -0.1159192 -0.0573672 0.0477896 0.0323042 -0.0376822 0.0247872 0.0015223 0.0606057 -0.0350447 0.1007958 -0.0347026 0.0413587 -0.0084838 -0.0073047 -0.0409786 -0.0410832 -0.0743577 -0.0193807 -0.074763 -0.0804547 0.0195853 0.058135 -0.0150293 0.025978 -0.0366879 0.0818643 -0.0268884 0.086375 -0.0448167 -0.1427843 -0.0727132 0.043993 -0.0734243 0.0287367 0.0430355 0.0150265 0.0303736 0.0493355 0.0245334 -0.012168 -0.1354788 0.0140596 -0.0491983 -0.1007433 -0.0567288 -0.0676174 -0.2601317 0.3362775 0.0230765 0.0144398 0.0975583 0.1738683 0.0358943 -0.0581407 0.0891103 0.1070818 0.2602035 -0.0503265 -0.1657927 0.0427794 0.0921677 -0.1451436 -0.1431215 -0.0524793 0.2141903 0.362468 -0.0627231 -0.0758237 -0.0680238 0.1039278 -0.19933 -0.0791114 -0.1188319 0.17609 0.0397346 0.0502316 -0.0414698 0.0839635 0.1833278 0.1378831 0.0429593 0.0786341 0.2830477 0.1863515 -0.1221964 -0.0477744 -0.1339024 0.1148352 0.0924573 -0.079336 0.0462 0.2395716 0.3299252 -0.0135441 -0.1073522 0.0175344 0.3151813 -0.0355041 -0.138053 -0.0934855 0.1402379 unknown
polarizability: 97.5654848|-5.5472775|85.6503897|5.4294853|0.7252471|82.2444766 unknown
InChI: InChI=1S/C6H14N2O3/c7-3-4(9)1-2-5(8)6(10)11/h4-5,9-10H,1-3,7-8H2
charge 0 multiplicity 1
25 atoms
O  2.047011 1.45017 -1.337341
O  -1.922332 -1.901418 -0.222106
O  -2.906332 -0.116581 -1.329952
N  -2.771035 1.286369 1.124343
N  3.523334 -1.236343 0.887828
C  0.787522 -0.098784 0.162229
C  -0.346823 0.919287 0.407422
C  2.136814 0.581694 -0.140704
C  -1.728962 0.294833 0.803667
C  3.295562 -0.430052 -0.321794
C  -2.261578 -0.549458 -0.348974
H  0.52593 -0.776378 -0.678154
H  0.91156 -0.735886 1.060433
H  -0.053932 1.588884 1.241807
H  -0.482458 1.561588 -0.483524
H  2.399364 1.279299 0.673329
H  -1.5772 -0.373116 1.670939
H  4.208538 0.152204 -0.540244
H  3.081733 -1.045896 -1.231905
H  -3.165522 1.739025 0.292701
H  -2.500389 1.949508 1.855687
H  1.812053 0.881977 -2.116711
H  4.498711 -1.444613 1.103919
H  2.906506 -2.041569 1.008903
H  -2.279673 -2.401945 -1.006699
