program: Gaussian 09
title: 000083226
version: EM64L-G09RevD.01
frameworkgroup: C1[X(C3H4Br2)]
method: RPBEPBE
basis: SDD
operation: Freq
keyword: #pfreq=noraman
keyword: PBEPBE/SDD
title: #p freq=noraman PBEPBE/SDD
converged: YES YES YES YES
title: Mulliken charges:
elementType: Br Br C C C H H H H
charge: 0.087147 0.068349 -0.705872 0.044621 -0.461245 0.238770 0.238772 0.242680 0.246779
chargesum: 0.00000
title: Mulliken charges with hydrogens summed into heavy atoms:
elementType: Br Br C C C
charge: 0.087147 0.068349 0.014349 0.291400 -0.461245
polarizability: 8.38540487e+01 -2.62334980e+00 7.56821969e+01 1.43390198e-03 2.27217403e-03 2.82876605e+01
1716.lowfreq: -13.8624 -8.7454 -0.0002 0.0002 0.0004 3.4325 104.7870 174.3434 178.0793
frequency: 104.7705 174.3431 178.0783 194.9154 338.3094 410.6638 461.5044 736.1682 806.4293 960.3197 1033.1683 1099.3513 1267.9578 1392.5316 1460.1877 1464.9561 1636.1435 2978.7138 3054.1096 3104.6555 3121.8028
redmass: 1.0229 14.2355 4.8805 2.9445 5.9376 4.9166 4.6185 5.1264 1.1499 1.9128 1.4744 2.4682 1.1910 1.2191 1.0690 1.0461 7.1253 1.0376 1.0975 1.0937 1.0936
irintensity: 0.4326 0.0012 0.3600 2.5697 6.2365 9.1909 8.5483 166.0322 31.1227 34.4282 0.2758 21.0611 21.6903 8.2353 13.8232 16.2401 19.3355 22.6569 16.9898 4.7507 11.4066
temp: 298.150 k
press: 1.00000 atm
elementType: 35 35 6 6 6 1 1 1 1
symmnumber: 1
zpe: 155389.4 jmol-1
zpe.correction: 0.059185 hartree
zpe.thermalcorrener: 0.065748 hartree
zpe.thermalcorrenthalpy: 0.066692 hartree
zpe.thermalcorrgfe: 0.026200 hartree
zpe.sumelectzpe: -143.213504 hartree
zpe.sumelectthermal: -143.206941 hartree
zpe.sumelectthermalent: -143.205996 hartree
zpe.sumelectthermalfe: -143.246488 hartree
dipole: -1.0464 2.1079 0.0000
dipole: 2.3533
quadrupole: -46.1607 -42.9583 -50.5882
quadrupole: -1.9242 0.0000 0.0003
quadrupole: 0.4084 3.6108 -4.0192 -1.9242 0.0000 0.0003
hfenergy: -143.2726883 hartree
pointgroup: C01 [X(C3H4Br2)]
dipole: 0.8586611 -0.3463025 -0.0000129 debye
dipolederiv: -0.5703337 -0.2882128 0.0000041 -0.3342968 -0.3179127 0.0000112 -0.0000191 0.0000063 0.0395244 -0.1049959 -0.0780548 0.0000034 -0.0372967 -0.7307849 0.000049 -0.0000073 0.0000696 0.043646 -0.1472861 -0.0540192 0.0000051 0.1111006 0.0213292 0.0000019 -0.0000047 0.0000127 0.0925866 -0.0867915 -0.0761127 -0.0000143 0.0722503 -0.3416775 0.0000224 -0.0000272 0.0000206 -0.132894 0.8142314 0.3802327 0.0000101 0.3519027 1.3264362 -0.0000921 0.0000418 -0.0001012 -0.2781014 -0.0271221 0.0287839 0.0774922 -0.0158356 0.0956727 -0.0789906 0.1165882 -0.0734352 -0.0303271 -0.0271265 0.0287749 -0.0774989 -0.0158545 0.0957026 0.0789681 -0.1165868 0.0734111 -0.0303536 0.1047282 0.0384056 -0.0000031 -0.0661997 -0.0877038 0.0000195 0.0000083 0.0000171 0.1193961 0.0446963 0.0202025 0.0000014 -0.0657704 -0.0610619 0.0000105 0.0000068 -0.000001 0.176523 unknown
polarizability: 82.8523286|3.7502573|76.683917|0.0004379|-0.0026509|28.2876605 unknown
InChI: InChI=1S/C3H4Br2/c1-2-3(4)5/h2H,1H3
charge 0 multiplicity 1
9 atoms
Br -2.126955 -0.933459 -0.000001
Br -0.482956 1.907136 -0.000138
C  2.180006 -0.187594 -0.000016
C  0.776845 -0.742809 0.00004
C  -0.382151 -0.042977 0.00002
H  2.73096 -0.546353 -0.890316
H  2.730961 -0.546192 0.890348
H  2.196151 0.913395 -0.000113
H  0.681139 -1.837546 0.000076
