program: Gaussian 09
title: 000083225
version: EM64L-G09RevD.01
frameworkgroup: C1[X(C13H24O2)]
method: RPBEPBE
basis: SDD
operation: Freq
keyword: #pfreq=noraman
keyword: PBEPBE/SDD
title: #p freq=noraman PBEPBE/SDD
converged: YES YES NO NO
title: Mulliken charges:
elementType: O O C C C C C C C C C C C C C H H H H H H H H H H H H H H H H H H H H H H H H
charge: -0.196164 -0.196152 -0.387559 -0.378060 -0.385097 -0.435984 -0.373897 -0.218746 -0.353572 -0.356709 0.212506 0.174673 -0.696520 -0.778145 -0.775432 0.206039 0.185961 0.242438 0.178833 0.189208 0.199099 0.252306 0.195602 0.187949 0.193180 0.219884 0.186470 0.189681 0.194078 0.195995 0.215237 0.209009 0.210389 0.222724 0.251486 0.274887 0.241616 0.260573 0.242215
chargesum: 0.00000
title: Mulliken charges with hydrogens summed into heavy atoms:
elementType: O O C C C C C C C C C C C C C
charge: -0.196164 -0.196152 0.004441 0.043210 0.003209 0.011924 0.007232 0.001138 0.022579 0.033363 0.212506 0.174673 -0.061885 -0.029048 -0.031028
polarizability: 1.85222136e+02 3.65690252e+00 1.34024460e+02 -1.52248180e+00 -3.37368053e+00 1.21905040e+02
1716.lowfreq: -24.3387 -7.3496 0.0003 0.0004 0.0007 5.4490 11.1177 18.1816 35.5617
frequency: -16.5502 18.0077 35.5039 48.5398 54.0345 64.2967 77.0026 97.2418 106.5537 111.8536 122.7390 130.3157 141.0182 143.2721 190.9954 207.8056 220.5655 258.6380 300.7354 328.9470 352.6244 405.2329 447.8039 461.1169 486.2438 552.9106 589.7877 625.2620 717.5640 718.9004 730.0239 758.7153 797.5954 840.1597 868.1478 887.4892 928.1593 940.6245 951.8970 975.7557 989.0267 1004.9731 1017.0400 1022.2495 1047.2809 1060.4676 1069.7124 1079.5323 1081.7931 1114.6207 1121.6238 1158.1484 1175.5736 1188.6882 1211.5720 1223.4025 1239.3068 1256.7728 1265.1882 1278.7238 1280.8572 1289.5459 1294.1112 1298.9486 1313.6896 1329.2914 1348.6061 1354.0622 1355.5272 1366.6074 1368.2274 1387.8758 1440.5828 1447.2911 1450.3590 1453.7990 1457.5512 1460.3724 1461.5845 1464.5915 1470.2526 1475.2416 1477.2124 1483.8331 1488.4532 1624.0588 1636.9882 2949.6234 2950.1304 2952.9364 2956.6702 2960.2075 2961.8906 2968.0596 2971.0563 2980.3712 2981.6224 2984.5011 2984.8107 2992.6286 3004.8482 3020.8282 3034.7380 3042.1290 3062.9868 3067.4909 3068.8128 3069.8479 3073.1690 3119.2678 3122.0786
redmass: 1.6016 3.9323 4.2906 3.6195 3.6647 3.6491 1.5919 1.5436 1.9570 1.5895 1.7351 1.9206 2.4741 2.3827 4.3373 3.6949 1.1314 2.6184 3.1596 3.7194 3.5227 3.0652 3.2622 3.4058 3.0572 3.3499 2.8167 3.1265 1.1614 1.1264 1.2011 1.4172 1.4990 1.8802 1.7758 1.8992 1.3584 2.1339 1.6606 2.1368 1.8977 1.9804 1.7966 2.0722 2.9711 2.3700 2.5625 2.2974 2.1887 1.7735 2.3746 2.0968 1.9803 1.7714 1.4255 1.5018 1.5896 1.3591 1.3719 1.0386 1.2536 1.0918 1.1339 1.3175 1.3893 1.3744 1.4826 1.6808 1.5801 1.2373 1.2386 1.2172 1.0662 1.0676 1.0712 1.0589 1.0649 1.0730 1.0685 1.0715 1.0804 1.0437 1.0795 1.0876 1.0919 7.9346 8.8645 1.0589 1.0591 1.0598 1.0636 1.0791 1.0630 1.0591 1.0366 1.0486 1.0541 1.0952 1.0371 1.0976 1.1005 1.1019 1.1001 1.0995 1.1018 1.1007 1.0934 1.0993 1.0966 1.1003 1.1011
irintensity: 0.2337 0.7790 1.2328 2.0719 2.7200 3.1315 0.4209 0.3937 1.0568 0.1388 0.1017 0.1815 1.4348 0.6971 0.6221 2.5646 0.0292 3.0703 0.1207 0.7084 1.1877 1.9311 0.1909 0.9368 3.1522 12.1378 6.9732 2.0602 21.2857 2.3886 3.6744 1.0708 0.5686 2.2779 1.5574 5.0114 0.3268 1.9923 16.2886 4.1906 0.9189 2.2770 2.1801 0.1185 0.6293 2.5559 0.1153 0.4205 0.9908 2.8118 21.2670 79.2309 23.6776 10.9248 68.4673 6.2962 56.0218 13.0396 21.4218 3.7750 11.0799 0.7513 3.4351 3.0134 27.5820 0.9980 3.7331 0.1443 2.1002 70.4140 64.5113 11.1652 20.4648 20.3883 3.3891 22.5525 20.7771 0.0249 2.7681 0.2274 1.7151 12.3608 2.5224 3.4798 27.4570 123.5042 105.0115 0.4765 0.9114 1.6913 2.9238 4.1636 59.0034 147.0238 37.4671 15.5805 20.7541 5.6763 7.1279 3.7531 3.3481 1.7471 50.7587 72.3189 46.8105 101.6465 16.7465 55.9131 11.3569 12.7963 13.0359
temp: 298.150 k
press: 1.00000 atm
elementType: 8 8 6 6 6 6 6 6 6 6 6 6 6 6 6 1 1 1 1 1 1 1 1 1 1 1 1 1 1 1 1 1 1 1 1 1 1 1 1
symmnumber: 1
zpe: 896361.9 jmol-1
zpe.correction: 0.341406 hartree
zpe.thermalcorrener: 0.360482 hartree
zpe.thermalcorrenthalpy: 0.361426 hartree
zpe.thermalcorrgfe: 0.291219 hartree
zpe.sumelectzpe: -659.001549 hartree
zpe.sumelectthermal: -658.982473 hartree
zpe.sumelectthermalent: -658.981528 hartree
zpe.sumelectthermalfe: -659.051736 hartree
dipole: 0.4604 -2.3234 3.7227
dipole: 4.4124
quadrupole: -99.1668 -94.9583 -95.9786
quadrupole: 3.0243 -15.8804 0.8859
quadrupole: -2.4656 1.7430 0.7226 3.0243 -15.8804 0.8859
hfenergy: -659.3429547 hartree
pointgroup: C01 [X(C13H24O2)]
dipole: -0.1944461 -0.7296007 -1.563151 debye
polarizability: 185.2525135|-2.0258836|132.866908|-3.3430742|4.7531027|123.0322135 unknown
InChI: InChI=1S/C13H24O2/c1-4-5-6-7-8-9-10-13(11(2)14)12(3)15/h13H,4-10H2,1-3H3
charge 0 multiplicity 1
39 atoms
O  2.311739 2.094647 0.836331
O  4.689754 -0.717983 0.768461
C  -1.154809 -0.486563 0.272623
C  0.118552 0.081869 -0.392356
C  -2.458068 0.094967 -0.320389
C  1.413216 -0.507714 0.211946
C  -3.735869 -0.47742 0.333817
C  2.706651 0.048894 -0.456771
C  -5.039507 0.108701 -0.253699
C  -6.318051 -0.470013 0.394687
C  3.032346 1.491743 0.001302
C  3.885531 -0.910885 -0.180759
C  -7.615723 0.123533 -0.195197
C  4.27107 2.139493 -0.59787
C  4.008906 -2.115852 -1.105443
H  -1.122285 -0.275264 1.361259
H  -1.166542 -1.592376 0.168483
H  0.133573 1.181465 -0.273819
H  0.088047 -0.130478 -1.482464
H  -2.485761 -0.103613 -1.412574
H  -2.45017 1.198739 -0.205055
H  1.458281 -0.271219 1.290932
H  1.386831 -1.612052 0.115441
H  -3.745226 -1.581539 0.215862
H  -3.706684 -0.282257 1.426231
H  2.550938 0.072204 -1.557659
H  -5.067426 -0.080084 -1.347569
H  -5.034735 1.211929 -0.129487
H  -6.323035 -1.572146 0.268488
H  -6.287919 -0.283069 1.487661
H  -8.514156 -0.307568 0.283843
H  -7.683831 -0.074468 -1.281744
H  -7.650002 1.22026 -0.052521
H  4.403594 1.875546 -1.662748
H  4.221155 3.233324 -0.480789
H  5.157052 1.766679 -0.049088
H  3.021976 -2.54451 -1.353498
H  4.652423 -2.884184 -0.649299
H  4.471565 -1.792239 -2.059168
