program: Gaussian 09
title: 000083219
version: EM64L-G09RevD.01
frameworkgroup: C1[X(C5H4Br2S)]
method: RPBEPBE
basis: SDD
operation: Freq
keyword: #p
keyword: freq=noraman
keyword: PBEPBE/SDD
title: #p freq=noraman PBEPBE/SDD
converged: NO YES NO NO
title: Mulliken charges:
elementType: Br Br S C C C C C H H H H
charge: 0.068023 0.083208 0.404387 0.676520 -0.165274 -0.783849 -0.756650 -0.529785 0.270823 0.231789 0.250405 0.250405
chargesum: 0.00000
title: Mulliken charges with hydrogens summed into heavy atoms:
elementType: Br Br S C C C C C
charge: 0.068023 0.083208 0.404387 0.676520 0.105549 -0.051251 -0.756650 -0.529785
polarizability: 1.63757296e+02 7.04413035e-02 9.27871556e+01 5.18904934e-03 -2.01174274e-04 3.85777971e+01
1716.lowfreq: -28.8808 -0.0019 -0.0015 0.0014 0.9277 5.0883 12.3633 82.3538 128.5595
frequency: -28.8745 82.3453 128.5579 181.7978 186.7763 226.4609 252.0337 309.2535 444.9303 460.5390 523.1424 583.9898 642.1198 840.6550 846.7776 915.7122 971.6785 1028.8892 1039.7061 1187.9312 1337.0084 1401.7166 1449.7424 1466.9946 1477.9548 1553.9715 2986.1221 3065.8785 3097.8599 3186.7811
redmass: 1.0174 26.8076 17.9262 4.0827 4.0628 29.9837 6.7713 10.9885 4.6332 6.7139 6.2656 3.4196 8.6531 1.3370 7.2865 8.2018 2.5885 2.1546 1.4636 1.3181 5.3056 1.2076 4.8071 1.0434 1.2428 6.6527 1.0370 1.0981 1.0991 1.0955
irintensity: 0.2980 0.4155 0.0014 1.2353 0.5887 0.3515 2.3454 3.6752 5.1989 21.3962 1.4147 1.7972 1.1250 24.8177 80.3736 3.4404 25.8600 31.2372 8.3441 13.4432 2.6775 10.4700 18.4022 14.4804 26.8531 25.6380 23.3303 14.6016 15.2436 0.8315
temp: 298.150 k
press: 1.00000 atm
elementType: 35 35 16 6 6 6 6 6 1 1 1 1
symmnumber: 1
zpe: 190668.8 jmol-1
zpe.correction: 0.072622 hartree
zpe.thermalcorrener: 0.080873 hartree
zpe.thermalcorrenthalpy: 0.081817 hartree
zpe.thermalcorrgfe: 0.036866 hartree
zpe.sumelectzpe: -617.294161 hartree
zpe.sumelectthermal: -617.285911 hartree
zpe.sumelectthermalent: -617.284967 hartree
zpe.sumelectthermalfe: -617.329918 hartree
dipole: 0.4098 1.9839 0.0000
dipole: 2.0258
quadrupole: -70.3864 -66.6268 -75.5590
quadrupole: 1.1762 0.0005 0.0001
quadrupole: 0.4710 4.2306 -4.7016 1.1762 0.0005 0.0001
hfenergy: -617.3667834 hartree
pointgroup: C01 [X(C5H4Br2S1)]
dipole: 0.271071 -0.7494923 -0.0000023 debye
dipolederiv: -0.5738553 -0.2093144 0.0000319 -0.2051144 -0.1174163 0.000012 0.0000289 0.0000657 0.0517444 -0.6926818 -0.0200226 0.0000364 -0.0306187 -0.0336981 -0.0000014 0.0001126 -0.0000188 0.0609779 -0.272868 0.0103591 0.0000295 0.0079042 -0.2407089 0.0000009 0.0000602 -0.0000117 0.2233642 -0.0976648 -0.3695157 0.0000158 -0.07108 -0.1039625 0.0000092 0.0000374 0.0000401 0.0510686 -0.3287159 0.2733589 0.0000347 0.0067803 -0.2523835 -0.0000064 0.0000626 -0.0000078 -0.1012416 -0.0063879 0.0953982 0.0000035 0.0713681 0.0604111 -0.0000072 -0.0000062 0.0000044 0.0733385 0.8681521 0.1783266 -0.0000776 0.238662 0.3124707 -0.0000251 -0.0000616 -0.0001104 -0.318463 0.981885 0.0973395 -0.0000692 0.0807309 0.3769751 0.0000116 -0.0002306 0.0000501 -0.2933137 0.0782558 -0.0333512 -0.0000002 -0.0643057 -0.0165762 -0.0000006 -0.0000058 0.0000008 0.1953473 0.0411379 -0.126513 -0.0000076 -0.0363211 -0.0968034 -0.0000118 0.0000022 -0.0000178 0.1158492 0.0013717 0.0519617 0.0951697 0.0009793 0.0558522 0.0398678 0.1076745 -0.0135302 -0.0293327 0.0013709 0.0519728 -0.0951668 0.0010151 0.0558398 -0.0398489 -0.1076741 0.0135356 -0.0293393 unknown
polarizability: 162.3289996|9.9665102|94.215452|-0.0051071|-0.0009404|38.5777971 unknown
InChI: InChI=1S/C5H4Br2S/c1-3-2-4(6)8-5(3)7/h2H,1H3
charge 0 multiplicity 1
12 atoms
Br 2.683533 1.427882 -0.000142
Br -3.435819 0.156418 0.000129
S  -0.539882 1.594934 0.000021
C  0.703294 -0.787974 0.0000
C  -0.724107 -1.058762 0.000015
C  1.761946 -1.867589 -0.000066
C  0.956863 0.576399 -0.000005
C  -1.514432 0.073889 -0.000013
H  -1.133065 -2.071425 0.000008
H  1.299895 -2.86875 -0.000128
H  2.414438 -1.790058 -0.889079
H  2.414437 -1.790163 0.888959
