program: Gaussian 09
title: 000081808
version: EM64L-G09RevD.01
frameworkgroup: C1[X(C15H18N4O)]
method: RPBEPBE
basis: SDD
operation: Freq
keyword: #p
keyword: freq=noraman
keyword: PBEPBE/SDD
title: #p freq=noraman PBEPBE/SDD
converged: YES YES NO NO
title: Mulliken charges:
elementType: O N N N N C C C C C C C C C C C C C C C H H H H H H H H H H H H H H H H H H
charge: -0.343953 -0.152842 -0.088385 -0.030385 -0.132974 0.429615 0.423643 -0.560699 -0.050979 -0.339143 -0.310074 -0.808965 -0.644222 -0.643945 0.357641 0.182875 -0.405903 -0.274666 -0.236856 -0.753624 0.244333 0.239478 0.271772 0.210417 0.240990 0.240972 0.240644 0.219767 0.240714 0.240534 0.240407 0.221045 0.275280 0.250178 0.277307 0.217705 0.256055 0.256243
chargesum: 0.00000
title: Mulliken charges with hydrogens summed into heavy atoms:
elementType: O N N N N C C C C C C C C C C C C C C C
charge: -0.343953 -0.152842 -0.088385 -0.030385 -0.132974 0.429615 0.423643 -0.316366 -0.050979 -0.099664 -0.038303 -0.116586 0.056903 0.058040 0.357641 0.182875 -0.130624 -0.024488 0.040450 -0.023621
polarizability: 6.28372507e+02 -6.62687464e+00 1.96571311e+02 6.86578392e-02 3.31229541e-02 9.47284620e+01
1716.lowfreq: -5.5461 -0.0004 0.0001 0.0008 6.5318 7.6062 19.6427 35.6685 51.3572
frequency: 19.5776 35.4844 51.3485 65.0996 77.0330 112.9282 124.4435 144.3980 144.7566 156.7645 172.1287 192.8773 211.1585 217.5000 223.2987 223.5249 268.8651 314.7858 345.6116 363.8337 394.8234 401.0726 424.6221 448.9241 469.0606 482.4712 498.7842 540.5579 553.1322 573.2335 594.8660 599.4004 607.1325 688.3147 717.6895 743.5368 750.8583 774.9689 818.4206 825.6905 849.2537 856.1750 882.4749 918.2930 943.0212 952.8212 955.7363 981.3372 1005.3479 1014.5469 1044.9756 1048.3772 1056.4131 1085.3752 1104.0693 1105.6312 1112.1403 1148.7221 1154.4746 1199.9815 1216.4658 1228.8100 1237.3274 1256.1537 1277.1509 1287.2552 1290.9105 1310.5710 1360.9200 1385.4314 1397.8387 1400.5656 1409.4834 1431.8428 1440.4830 1442.2166 1455.9108 1460.1634 1461.5303 1465.4413 1477.9610 1478.3220 1480.2171 1497.3977 1499.2959 1519.6053 1537.1144 1546.8455 1624.4085 1626.7769 2950.8180 2957.6402 2988.5255 2991.3156 3019.9831 3023.4100 3066.9536 3074.8376 3087.5080 3102.2555 3112.1682 3114.2452 3150.3509 3157.0632 3170.9458 3171.0592 3174.7628 3211.5370
redmass: 3.8459 4.6934 4.9845 2.5101 4.6738 1.0537 1.9065 1.6571 3.9136 1.4028 1.4995 2.3285 4.4589 2.8965 3.3126 3.1189 2.9857 3.1465 3.4607 5.8099 4.5463 5.2872 5.8560 3.0048 3.1056 4.3943 4.1509 4.0997 5.5940 3.2665 4.6858 2.7708 5.5870 5.7705 4.2130 5.8842 3.2353 4.8092 1.4637 1.4346 5.2128 1.5512 5.9729 1.3701 1.3249 2.8304 2.4247 1.3401 1.6226 1.6102 1.5652 1.5143 1.5224 1.5592 1.2370 2.5483 1.3289 1.8710 1.5050 2.0940 2.7630 5.7095 1.9633 3.6408 2.6546 2.7198 2.1025 4.2807 2.8656 3.4751 1.2972 1.8556 1.6566 1.2121 1.0449 1.6133 1.0471 1.3970 1.2768 1.0399 1.0458 2.5125 1.4208 1.3278 1.4788 1.6613 7.0766 7.2312 6.0400 6.2144 1.0366 1.0389 1.0360 1.0370 1.0999 1.1025 1.0961 1.0967 1.1007 1.0968 1.0948 1.1004 1.0865 1.0899 1.0940 1.0924 1.0914 1.0967
irintensity: 0.4168 0.0577 0.4922 0.0017 3.4323 0.5508 2.2936 2.1098 0.6156 1.9949 5.2326 2.8604 0.5113 2.9457 0.7430 0.4239 1.3064 1.5103 8.1118 1.1918 7.5596 0.3512 12.2621 2.1837 7.9286 48.5686 8.4029 8.2918 10.1808 1.1733 2.6512 6.6784 7.9000 1.5914 2.7054 2.3394 0.5386 17.7060 9.7668 66.2154 22.3976 35.4225 13.2385 16.2432 0.2651 0.0109 34.0028 1.1401 12.0582 2.8771 9.7102 8.2570 24.5108 18.0832 0.0346 80.1260 1.0354 3.8715 2.9750 97.6882 1.8623 179.8579 138.3009 25.4735 113.2047 145.2116 24.0488 134.8092 273.1751 93.9091 5.5374 18.8778 12.5896 8.3276 13.0171 5.1614 12.7602 14.9901 61.7928 0.0738 22.8954 7.9753 8.7922 3.2029 5.5124 288.0981 7.2112 22.1424 501.6752 221.5843 86.7525 223.7069 25.1686 16.2166 10.0670 64.5901 9.6531 13.9406 25.5726 3.7021 50.7139 7.7513 4.5419 24.8131 13.2290 11.9887 2.5731 1.0667
temp: 298.150 k
press: 1.00000 atm
elementType: 8 7 7 7 7 6 6 6 6 6 6 6 6 6 6 6 6 6 6 6 1 1 1 1 1 1 1 1 1 1 1 1 1 1 1 1 1 1
symmnumber: 1
zpe: 800433.0 jmol-1
zpe.correction: 0.304869 hartree
zpe.thermalcorrener: 0.324624 hartree
zpe.thermalcorrenthalpy: 0.325568 hartree
zpe.thermalcorrgfe: 0.255629 hartree
zpe.sumelectzpe: -875.086863 hartree
zpe.sumelectthermal: -875.067108 hartree
zpe.sumelectthermalent: -875.066164 hartree
zpe.sumelectthermalfe: -875.136102 hartree
dipole: -9.3244 0.5934 0.0079
dipole: 9.3433
quadrupole: -109.7750 -103.3745 -122.6086
quadrupole: 4.6696 -0.0971 0.0111
quadrupole: 2.1444 8.5449 -10.6892 4.6696 -0.0971 0.0111
hfenergy: -875.3917315 hartree
pointgroup: C01 [X(C15H18N4O1)]
dipole: 3.6654735 -0.2720695 0.0529398 debye
polarizability: 628.0508864|-11.2491364|196.5587704|8.4502354|4.3326597|95.0626229 unknown
InChI: InChI=1S/C15H18N4O/c1-11-9-14(18(3)4)5-6-15(11)17-16-13-7-8-19(20)12(2)10-13/h5-10H,1-4H3
charge 0 multiplicity 1
38 atoms
O  -6.491583 0.384141 -0.042295
N  5.432801 0.155899 0.147751
N  -0.218692 -0.285166 0.022195
N  -5.155964 0.461971 -0.019738
N  -0.924716 0.834789 0.06078
C  4.042639 0.069946 0.115971
C  1.977778 -1.308975 0.014079
C  3.378848 -1.198808 0.045589
C  1.181037 -0.113738 0.054065
C  3.227383 1.253256 0.153917
C  1.836739 1.154083 0.123619
C  1.320854 -2.674221 -0.060869
C  6.092878 1.468574 0.218342
C  6.251677 -1.064715 0.109681
C  -4.382554 -0.720611 -0.059264
C  -2.324785 0.635357 0.029927
C  -2.990142 -0.626941 -0.034439
C  -3.135519 1.804428 0.067916
C  -4.523925 1.701791 0.042624
C  -5.167248 -1.998995 -0.125579
H  3.96721 -2.120351 0.014666
H  3.69074 2.242094 0.207935
H  1.21004 2.050923 0.153213
H  2.077632 -3.477503 -0.082109
H  0.653033 -2.840145 0.802874
H  0.68858 -2.760246 -0.962248
H  5.807465 2.021753 1.135115
H  7.184716 1.328353 0.233107
H  5.841955 2.100714 -0.65649
H  6.035621 -1.727998 0.970773
H  6.080413 -1.642831 -0.820255
H  7.317681 -0.792745 0.149417
H  -2.386951 -1.537988 -0.064643
H  -2.658878 2.787181 0.117648
H  -5.206721 2.551748 0.06909
H  -4.487589 -2.865148 -0.158447
H  -5.840675 -2.088772 0.746282
H  -5.823578 -2.007504 -1.0148
