program: Gaussian 09
title: 000083224
version: EM64L-G09RevD.01
frameworkgroup: C1[X(C12H22O3)]
method: RPBEPBE
basis: SDD
operation: Freq
keyword: #pfreq=noraman
keyword: PBEPBE/SDD
title: #p freq=noraman PBEPBE/SDD
converged: YES YES NO NO
title: Mulliken charges:
elementType: O O O C C C C C C C C C C C C H H H H H H H H H H H H H H H H H H H H H H
charge: -0.190268 -0.251976 -0.249521 -0.369851 -0.372272 -0.375876 -0.353012 -0.512803 -0.356166 0.197744 -0.696564 -0.601247 0.272650 -0.231025 -0.670897 0.193898 0.186517 0.191570 0.191493 0.217848 0.211490 0.187806 0.187124 0.229355 0.284523 0.195377 0.195381 0.215348 0.209428 0.209747 0.272900 0.239686 0.230535 0.232251 0.212852 0.235295 0.230661
chargesum: 0.00000
title: Mulliken charges with hydrogens summed into heavy atoms:
elementType: O O O C C C C C C C C C C C C
charge: -0.190268 -0.251976 -0.249521 0.010564 0.010792 0.053462 0.021917 0.001075 0.034592 0.197744 -0.062042 -0.088662 0.272650 0.231761 0.007912
polarizability: 1.83033771e+02 -3.90500814e+00 1.25628032e+02 4.54866944e+00 4.75232712e+00 1.18344864e+02
1716.lowfreq: -0.0007 -0.0003 0.0009 4.7473 8.2401 11.5256 17.3442 27.2619 49.5000
frequency: 16.8714 26.5864 48.7637 49.5871 54.8450 59.4404 77.3015 94.6048 117.1291 138.5546 143.9326 145.5590 163.9973 174.9383 235.8398 238.5549 256.2367 266.1720 332.2369 373.8566 408.1229 413.8552 469.2582 486.8940 542.7533 624.5044 696.4851 723.5395 733.0116 766.1591 792.8215 798.9449 820.2700 843.3058 889.0694 896.2394 921.8409 933.5400 998.3160 1000.2141 1020.2396 1031.9679 1051.4744 1069.2356 1082.2403 1085.5223 1102.4388 1114.3299 1120.9933 1133.2648 1135.0239 1186.7938 1209.5268 1225.7908 1235.3309 1249.5505 1264.6988 1277.3655 1279.8186 1285.0279 1297.1674 1298.4332 1321.5006 1351.4544 1356.5254 1360.1966 1366.6726 1391.9470 1401.9503 1430.1833 1438.3233 1462.3006 1463.3621 1463.4832 1468.3374 1473.3831 1475.6203 1479.1890 1483.2544 1486.2932 1488.8347 1617.2276 1641.1003 2949.8118 2952.0362 2952.7758 2960.3020 2969.0960 2971.9249 2986.6013 2990.2350 2996.1975 2997.6508 3000.3281 3013.0976 3016.0462 3018.6885 3035.1432 3054.9107 3068.4513 3070.6348 3072.4532 3094.1217 3110.2919 3125.0275
redmass: 4.1301 4.3169 1.8005 4.0085 3.6165 2.8861 3.5005 1.7802 2.6973 3.5987 2.4441 1.8952 3.6005 2.3517 3.0626 1.1221 1.6317 3.3384 4.3436 3.3790 2.3104 3.5096 3.3022 2.7527 4.6122 3.9085 2.3270 1.0935 1.2438 1.4060 3.0563 1.1059 1.9895 2.1696 1.9171 1.8942 1.7336 3.0462 1.2166 4.1687 2.2465 3.0465 3.2269 2.0692 2.1513 2.2133 1.4817 2.2608 2.5835 2.8950 1.5270 1.7257 1.4949 1.3517 1.3732 1.1400 1.3248 1.2942 1.4283 1.0561 1.1023 1.1084 1.4243 1.5476 1.4043 1.6451 1.7079 1.2185 1.2619 1.0912 1.0953 1.0741 1.0398 1.0692 1.0750 1.0636 1.0758 1.0419 1.0825 1.0665 1.0911 9.5295 8.4485 1.0629 1.0593 1.0589 1.0592 1.0581 1.0372 1.0968 1.0603 1.0980 1.0359 1.0956 1.0581 1.1028 1.0628 1.1043 1.1033 1.1007 1.0992 1.1067 1.0985 1.1027 1.0997
irintensity: 0.8556 0.9721 0.1333 2.7927 0.3471 2.2355 1.5432 0.0599 0.5562 0.1853 2.6123 0.0175 6.8586 3.9293 2.7401 0.0206 1.9092 5.9676 5.9056 10.1507 0.2895 3.5503 3.5414 0.3398 7.2213 8.6022 3.5808 13.8955 1.0747 4.1769 7.8286 4.4441 2.3925 0.7086 2.8363 21.4892 10.1959 2.5787 1.2737 1.8788 56.8102 16.1151 10.8595 70.1420 1.6940 27.6371 2.8536 8.0907 61.2886 349.0507 27.8525 2.4808 48.6242 41.5462 5.7576 1.2688 64.6520 65.8786 37.9478 4.8534 2.8905 0.1104 12.8410 17.5096 3.0755 0.5768 17.4878 11.8941 22.3580 24.6502 31.1140 0.1258 12.1170 0.6481 1.8734 4.5630 1.6277 12.3057 4.3937 14.8573 25.4369 247.9922 64.4837 8.4191 5.9695 0.4924 25.5947 114.5742 32.6813 0.9602 34.4647 1.1649 20.4708 1.3177 16.0887 0.8494 3.9734 58.0041 76.5955 100.3551 55.0286 7.4320 27.1699 41.5621 3.0540
temp: 298.150 k
press: 1.00000 atm
elementType: 8 8 8 6 6 6 6 6 6 6 6 6 6 6 6 1 1 1 1 1 1 1 1 1 1 1 1 1 1 1 1 1 1 1 1 1 1
symmnumber: 1
zpe: 839523.4 jmol-1
zpe.correction: 0.319758 hartree
zpe.thermalcorrener: 0.338762 hartree
zpe.thermalcorrenthalpy: 0.339706 hartree
zpe.thermalcorrgfe: 0.268871 hartree
zpe.sumelectzpe: -694.930772 hartree
zpe.sumelectthermal: -694.911767 hartree
zpe.sumelectthermalent: -694.910823 hartree
zpe.sumelectthermalfe: -694.981658 hartree
dipole: 1.4058 -1.0481 -1.4107
dipole: 2.2505
quadrupole: -77.3221 -96.4160 -94.1841
quadrupole: -6.8106 -0.4514 -9.6336
quadrupole: 11.9853 -7.1086 -4.8767 -6.8106 -0.4514 -9.6336
hfenergy: -695.2505296 hartree
pointgroup: C01 [X(C12H22O3)]
dipole: -0.5365944 0.4754521 0.5195765 debye
polarizability: 183.4638312|1.8576162|116.2590267|-1.8768738|2.83419|127.2838084 unknown
InChI: InChI=1S/C12H22O3/c1-3-5-6-7-8-9-11(13)10-12(14)15-4-2/h3-10H2,1-2H3
charge 0 multiplicity 1
37 atoms
O  -1.095541 -0.133241 -2.460379
O  -4.248296 0.482637 -0.079021
O  -2.430499 1.148818 1.219041
C  2.584673 0.681026 -0.173915
C  3.806192 -0.245475 -0.368086
C  1.351417 0.225988 -0.98475
C  5.044564 0.19317 0.445214
C  0.132186 1.138943 -0.761656
C  6.260822 -0.742436 0.257456
C  -1.099967 0.74839 -1.565283
C  7.493475 -0.302658 1.07666
C  -2.410193 1.508611 -1.231671
C  -2.992766 1.051295 0.101155
C  -4.921265 -0.036579 1.157544
C  -6.281205 -0.570581 0.722805
H  2.325291 0.721959 0.904778
H  2.861433 1.716129 -0.466417
H  4.069565 -0.28377 -1.445857
H  3.52752 -1.28092 -0.080598
H  1.596796 0.195606 -2.063641
H  1.083461 -0.811928 -0.706001
H  4.780371 0.236187 1.522826
H  5.330427 1.226059 0.154642
H  0.380889 2.18992 -1.029782
H  -0.160549 1.181381 0.308208
H  6.525535 -0.783362 -0.819017
H  5.972754 -1.774301 0.545171
H  8.346888 -0.989402 0.92643
H  7.821765 0.713074 0.785026
H  7.262809 -0.281565 2.158673
H  -3.140557 1.341449 -2.036451
H  -2.182893 2.587319 -1.141253
H  -4.997736 0.793262 1.882924
H  -4.275259 -0.819304 1.594276
H  -6.820341 -0.974849 1.598865
H  -6.168351 -1.379215 -0.019048
H  -6.895415 0.229466 0.27573
