program: Gaussian 09
title: 000077771
version: EM64L-G09RevD.01
frameworkgroup: C1[X(C8H6Cl2O2)]
method: RPBEPBE
basis: SDD
operation: Freq
keyword: #p
keyword: freq=noraman
keyword: PBEPBE/SDD
title: #p freq=noraman PBEPBE/SDD
converged: NO YES NO NO
title: Mulliken charges:
elementType: Cl Cl O O C C C C C C C C H H H H H H
charge: -0.052650 -0.079331 -0.255841 -0.045942 0.358015 -0.321853 -0.349524 -0.201901 -0.179175 -0.240200 -0.120687 -0.068138 0.248908 0.265541 0.262288 0.262396 0.256937 0.261157
chargesum: 0.00000
title: Mulliken charges with hydrogens summed into heavy atoms:
elementType: Cl Cl O O C C C C C C C C
charge: -0.052650 -0.079331 -0.255841 -0.045942 0.358015 -0.072945 -0.083983 0.055036 0.081982 0.284484 -0.120687 -0.068138
polarizability: 1.75521611e+02 5.40424641e+00 1.10867963e+02 -1.47271470e-01 -1.15607677e-01 4.55840675e+01
1716.lowfreq: -6.5411 -6.3382 -0.0023 -0.0023 -0.0022 7.9948 30.4994 43.0328 67.3198
frequency: 30.3327 42.9494 67.2989 120.7729 153.4420 195.2532 204.2462 292.0920 315.8899 381.0265 391.6980 415.0759 467.7124 476.5400 497.7716 600.4086 623.0827 698.1737 725.2508 800.4739 823.0257 827.6071 928.1811 944.7835 957.5108 981.0982 992.4592 1019.5056 1073.2532 1110.5898 1177.1247 1198.3056 1216.7520 1291.6176 1342.8550 1376.1979 1403.8999 1437.3723 1474.7134 1586.1233 1605.2919 1793.6433 2961.1311 3016.0700 3151.9493 3162.6773 3173.8012 3182.0198
redmass: 7.9614 7.7425 12.4604 7.0510 2.8808 10.8594 14.7281 6.1958 7.0821 13.1901 16.4240 2.9885 5.1845 3.3875 2.7251 9.0622 7.2259 3.4980 7.9323 1.3167 7.2943 1.5010 1.3490 5.1022 1.3468 1.7870 4.0139 5.2320 2.6159 1.3089 1.1827 1.0659 4.1617 1.2599 1.5149 4.8578 3.5231 1.1101 2.2653 7.3153 6.7814 11.6090 1.0554 1.1036 1.0885 1.0888 1.0967 1.0979
irintensity: 1.1146 0.1054 1.9479 0.5909 16.5861 0.6793 1.4353 2.3604 1.9171 10.8850 27.7186 0.0399 0.1349 0.3688 24.7576 22.6150 1.1892 0.3163 163.0986 21.5634 70.8228 72.4268 0.0064 169.2391 0.4313 0.0943 38.8668 7.5393 39.6907 12.2243 44.5916 0.0124 246.7330 0.9319 3.3697 5.6909 2.1369 87.8943 182.1556 11.6104 16.0431 243.4622 41.3140 8.0057 11.4425 1.4238 4.0480 0.8731
temp: 298.150 k
press: 1.00000 atm
elementType: 17 17 8 8 6 6 6 6 6 6 6 6 1 1 1 1 1 1
symmnumber: 1
zpe: 315270.1 jmol-1
zpe.correction: 0.120080 hartree
zpe.thermalcorrener: 0.131535 hartree
zpe.thermalcorrenthalpy: 0.132479 hartree
zpe.thermalcorrgfe: 0.080115 hartree
zpe.sumelectzpe: -1378.132365 hartree
zpe.sumelectthermal: -1378.120911 hartree
zpe.sumelectthermalent: -1378.119966 hartree
zpe.sumelectthermalfe: -1378.172331 hartree
dipole: 0.8488 -1.7273 0.0115
dipole: 1.9247
quadrupole: -104.9874 -79.4653 -84.1588
quadrupole: 7.1935 -0.0497 -0.0772
quadrupole: -15.4502 10.0718 5.3784 7.1935 -0.0497 -0.0772
hfenergy: -1378.2524455 hartree
pointgroup: C01 [X(C8H6Cl2O2)]
dipole: 0.3627889 0.6619577 0.0597796 debye
dipolederiv: -0.8519351 -0.0779605 -0.0065372 -0.1109481 -0.1329646 -0.0064483 -0.0100289 -0.0065584 -0.0641128 -0.7615142 0.3927635 0.0443099 0.5197598 -0.6703102 -0.0570737 0.0579967 -0.0565403 -0.1519263 -2.0649953 0.1580148 0.0221282 0.1033117 -0.2601455 0.0004317 0.0124001 -0.0008781 -0.2680941 -0.4940135 -0.175762 -0.0153751 0.1744615 -1.0582374 -0.0902751 0.0205287 -0.0868409 -0.1867 1.7077756 0.0248275 -0.0020107 0.3415006 0.0234802 -0.0104036 0.0337512 -0.0083931 0.1050296 -0.2645371 0.0419736 0.0048162 -0.2515665 -0.035108 0.0164675 -0.0245087 0.0153583 -0.1997201 -0.3345616 -0.0140058 -0.0001203 0.1363143 0.0493353 0.0202739 0.0146314 0.0203003 -0.1613816 -0.1791043 -0.0807852 -0.0075917 0.0287116 0.0621326 0.0142786 0.0026886 0.014363 -0.0890656 -0.1390765 -0.0187503 -0.0015705 -0.0450883 0.0676407 0.0152902 -0.0043996 0.0154103 -0.0933484 0.6399386 -0.2522158 -0.0253032 -0.7707253 0.1435641 -0.0186019 -0.0762055 -0.0203899 0.3634523 1.1638366 0.1689592 0.0151351 0.1519195 -0.0054577 0.0081076 0.0136341 0.0083131 -0.0910865 1.4181527 -0.2345452 -0.0339134 -0.6783536 1.760594 0.1678121 -0.0801336 0.1639841 0.170339 -0.0065747 0.091399 0.0086578 0.115603 0.0087896 -0.0158441 0.0108676 -0.0156323 0.17195 0.0705858 -0.0616016 -0.0058964 -0.0547077 0.0043217 -0.0162321 -0.0050086 -0.0161044 0.1749007 -0.0013092 0.005349 0.0114887 0.1676906 0.0015296 0.0654313 -0.0097835 0.073118 0.0094274 0.0003993 0.0059301 -0.0110275 0.1613388 0.0288842 -0.0630777 0.0424422 -0.0691548 -0.0178398 0.0651543 -0.048354 -0.0044161 -0.0525306 -0.0126642 -0.0167126 -0.0047796 -0.0168043 0.1637192 0.0317784 0.0747636 0.0072262 0.0633085 0.0246156 -0.0134236 0.0059074 -0.0135505 0.164457 unknown
polarizability: 174.9379939|-8.0759804|110.8216364|-1.2165096|6.4053029|46.2140108 unknown
InChI: InChI=1S/C8H6Cl2O2/c9-6-1-3-7(4-2-6)12-5-8(10)11/h1-4H,5H2
charge 0 multiplicity 1
18 atoms
Cl 4.859088 0.4206 0.061459
Cl -4.660513 1.368419 0.198368
O  -1.081827 -0.60373 -0.032877
O  -3.811922 -1.23695 -0.07163
C  0.289798 -0.271122 -0.002173
C  0.794816 1.045596 0.122525
C  1.169871 -1.374875 -0.107679
C  2.194364 1.253171 0.141438
C  2.561759 -1.166049 -0.088221
C  -2.026666 0.49089 0.084401
C  3.058035 0.149444 0.036646
C  -3.426685 -0.088748 0.039955
H  0.134554 1.91401 0.204974
H  0.750938 -2.380541 -0.202922
H  -1.930942 1.220602 -0.746569
H  -1.913832 1.04315 1.04068
H  2.597794 2.265348 0.236694
H  3.248869 -2.013014 -0.168869
