program: Gaussian 09
title: 000077773
version: EM64L-G09RevD.01
frameworkgroup: C1[X(C14H14O5S2)]
method: RPBEPBE
basis: SDD
operation: Freq
keyword: #p
keyword: freq=noraman
keyword: PBEPBE/SDD
title: #p freq=noraman PBEPBE/SDD
converged: YES YES NO NO
title: Mulliken charges:
elementType: S S O O O O O C C C C C C C C C C C C C C H H H H H H H H H H H H H H
charge: 1.033589 1.033568 -0.541229 -0.486753 -0.485345 -0.485121 -0.486682 -0.053099 -0.053154 -0.232294 -0.232412 -0.221490 -0.221272 0.451076 0.451080 -0.360567 -0.360484 -0.354367 -0.354405 -0.796385 -0.796373 0.285125 0.285129 0.286541 0.286509 0.246882 0.246892 0.247615 0.247631 0.246306 0.231143 0.232432 0.232443 0.246313 0.231156
chargesum: 0.00000
title: Mulliken charges with hydrogens summed into heavy atoms:
elementType: S S O O O O O C C C C C C C C C C C C C C
charge: 1.033589 1.033568 -0.541229 -0.486753 -0.485345 -0.485121 -0.486682 -0.053099 -0.053154 0.052831 0.052717 0.065052 0.065237 0.451076 0.451080 -0.113685 -0.113593 -0.106752 -0.106774 -0.086504 -0.086460
polarizability: 2.90384200e+02 -1.05846485e-02 2.26302998e+02 -1.48364131e+01 3.29528152e-02 2.01042297e+02
1716.lowfreq: -1.4123 -0.0026 -0.0022 -0.0021 5.0835 7.9700 14.3279 15.9480 20.8372
frequency: 13.9676 14.5769 20.7731 23.3975 24.7012 40.4898 46.8091 62.5346 90.0364 118.2588 126.1808 133.2636 135.6607 181.3125 215.5397 229.5117 247.2919 275.7385 294.2227 297.6594 309.7826 340.6419 363.3000 382.2475 383.7226 407.1088 407.1714 411.6230 451.0522 465.5433 483.3989 503.9453 521.6283 584.3780 590.5326 619.8557 619.8681 705.2251 705.2393 777.4867 777.6801 824.6162 826.9597 827.5221 844.7624 846.4746 847.3126 964.7663 965.4586 967.6528 970.3756 984.6334 984.6640 990.1577 990.3286 992.3635 992.6753 1048.9709 1049.1875 1051.8752 1052.4005 1121.5007 1121.6226 1186.3084 1187.5401 1219.6286 1219.8619 1299.4958 1299.5548 1383.0109 1383.1652 1394.2914 1394.3785 1399.3751 1399.4245 1470.4050 1470.4502 1471.7545 1471.9438 1473.3900 1473.4278 1592.2472 1592.2770 1594.3381 1594.4044 2981.5384 2981.5723 3064.5720 3064.6080 3094.3762 3094.3949 3139.6591 3139.6741 3141.3189 3141.3844 3165.9022 3165.9299 3168.5172 3168.5922
redmass: 2.9113 3.0487 1.4453 1.3186 2.9288 3.9305 5.3896 6.8521 10.8889 4.6409 6.6181 6.6748 6.1919 13.7272 8.1291 8.5447 9.2679 6.3345 4.8904 4.6698 4.6946 9.1502 7.1838 3.9379 4.0807 2.8683 2.9089 13.5641 7.4781 7.3483 9.4626 3.3536 4.3108 5.9114 6.2923 6.9572 6.9571 3.2902 3.2955 4.8866 4.8845 9.4153 1.4311 1.3864 12.2217 1.2453 1.2445 1.3213 1.3103 7.9261 6.9942 1.4302 1.4390 5.3822 4.5497 1.5854 1.5365 1.5995 1.6004 2.4557 2.4513 1.2863 1.2873 1.1314 1.1339 3.0835 3.0654 1.2595 1.2594 6.2395 6.2519 2.9548 2.9592 1.2190 1.2192 1.1116 1.1119 2.1765 2.1540 1.0891 1.0946 5.9753 5.9734 6.9266 6.9318 1.0391 1.0391 1.0946 1.0946 1.1002 1.1002 1.0894 1.0894 1.0895 1.0895 1.0957 1.0957 1.0970 1.0971
irintensity: 0.8460 1.0384 0.5344 0.5549 0.0976 0.0035 0.0338 0.3107 0.1365 0.3434 2.1978 0.8667 1.2238 0.0329 10.9148 3.5438 5.2198 12.7336 3.5411 0.0027 5.8197 5.0991 31.9358 5.0031 2.1938 0.0347 0.9371 60.1193 21.1479 36.6313 580.7899 391.2148 29.7607 46.9418 6.5964 0.0190 0.4496 0.4681 1.3702 1.6481 1.5935 78.6923 34.8953 60.0720 100.2038 0.1829 0.0869 2.7235 0.0610 23.4234 89.8818 3.8157 0.8625 1.6991 0.2642 1.3073 13.3063 54.5021 0.6543 33.6539 27.3129 1.8207 13.2151 24.3302 5.7705 12.1860 5.1800 0.6553 4.4968 1.4790 0.0318 3.8992 18.9246 20.6886 14.0702 20.8993 13.9000 15.5926 19.9434 24.4846 5.4278 23.0804 21.5713 0.7720 0.7982 24.1529 16.2627 9.2639 23.3896 10.4571 17.3535 7.2740 17.2954 11.8360 2.4926 0.0409 0.0622 11.9913 8.9331
temp: 298.150 k
press: 1.00000 atm
elementType: 16 16 8 8 8 8 8 6 6 6 6 6 6 6 6 6 6 6 6 6 6 1 1 1 1 1 1 1 1 1 1 1 1 1 1
symmnumber: 1
zpe: 652876.0 jmol-1
zpe.correction: 0.248667 hartree
zpe.thermalcorrener: 0.271469 hartree
zpe.thermalcorrenthalpy: 0.272413 hartree
zpe.thermalcorrgfe: 0.190456 hartree
zpe.sumelectzpe: -1712.252424 hartree
zpe.sumelectthermal: -1712.229623 hartree
zpe.sumelectthermalent: -1712.228678 hartree
zpe.sumelectthermalfe: -1712.310635 hartree
dipole: 0.0079 10.3683 0.0002
dipole: 10.3683
quadrupole: -95.7411 -147.5058 -137.1863
quadrupole: -0.0090 -8.6042 0.0067
quadrupole: 31.0699 -20.6947 -10.3752 -0.0090 -8.6042 0.0067
hfenergy: -1712.5010917 hartree
pointgroup: C01 [X(C14H14O5S2)]
dipole: -0.0009546 -4.0792113 -0.0053423 debye
polarizability: 290.6642665|-0.0710342|226.3029489|13.9647317|0.051839|200.762279 unknown
InChI: InChI=1S/C14H14O5S2/c1-11-3-7-13(8-4-11)20(15,16)19-21(17,18)14-9-5-12(2)6-10-14/h3-10H,1-2H3
charge 0 multiplicity 1
35 atoms
S  -1.525247 1.760395 0.673465
S  1.524554 1.758534 -0.667886
O  -0.000641 0.856489 0.004523
O  -1.348343 1.923926 2.270769
O  -1.866306 3.02298 -0.275149
O  1.870267 3.019755 0.280811
O  1.344658 1.923518 -2.264717
C  -2.689522 0.333476 0.311794
C  2.685959 0.328703 -0.309399
C  -2.946776 -0.584709 1.341257
C  2.940058 -0.588749 -1.340334
C  -3.262747 0.259092 -0.967694
C  3.260543 0.251414 0.969325
C  -4.460835 -1.762298 -0.211838
C  4.453558 -1.771446 0.209421
C  -3.845536 -1.637159 1.062378
C  3.837001 -1.643367 -1.063895
C  -4.157517 -0.803449 -1.216159
C  4.153379 -0.813303 1.215361
C  -5.447451 -2.881042 -0.487484
C  5.438204 -2.892571 0.482378
H  -2.473273 -0.472312 2.321552
H  2.465594 -0.474143 -2.319907
H  -3.029258 1.006202 -1.732617
H  3.0295 0.997956 1.73554
H  -4.069702 -2.370312 1.845225
H  4.05874 -2.375941 -1.847974
H  -4.623395 -0.889211 -2.204237
H  4.62019 -0.901333 2.202798
H  -6.480881 -2.555486 -0.259337
H  -5.238911 -3.769702 0.132597
H  -5.427987 -3.187855 -1.547492
H  5.419768 -3.20042 1.5421
H  6.471958 -2.56898 0.252911
H  5.226797 -3.780151 -0.138286
