program: Gaussian 09
title: 000077703
version: EM64L-G09RevD.01
frameworkgroup: C1[X(C8H7NO3S)]
method: RPBEPBE
basis: SDD
operation: Freq
keyword: #p
keyword: freq=noraman
keyword: PBEPBE/SDD
title: #p freq=noraman PBEPBE/SDD
converged: NO YES NO NO
title: Mulliken charges:
elementType: S O O O N C C C C C C C C H H H H H H H
charge: 0.935130 -0.477427 -0.477303 -0.129467 -0.300288 -0.024490 0.449780 -0.234462 -0.234392 -0.355100 -0.355126 -0.794571 0.213008 0.285068 0.285048 0.249765 0.249796 0.233808 0.233797 0.247427
chargesum: 0.00000
title: Mulliken charges with hydrogens summed into heavy atoms:
elementType: S O O O N C C C C C C C C
charge: 0.935130 -0.477427 -0.477303 -0.129467 -0.300288 -0.024490 0.449780 0.050606 0.050656 -0.105335 -0.105331 -0.079538 0.213008
polarizability: 2.02442513e+02 4.82656886e+00 8.85654658e+01 -1.23540699e-01 9.38689724e-01 1.12581949e+02
1716.lowfreq: -27.1450 -9.0405 -1.0694 -0.0019 -0.0017 -0.0012 8.5736 26.1148 41.0206
frequency: -26.3892 25.8669 40.9154 47.7158 109.9223 130.0509 162.7919 222.1635 228.7611 269.1813 303.1046 305.0043 382.3398 398.5008 406.8837 443.1630 507.2135 528.5082 587.5131 603.3005 618.5836 703.5938 776.4782 824.7244 831.5903 843.4857 962.1515 964.2240 982.4510 988.9294 993.5045 1049.3856 1051.4672 1122.4717 1187.4967 1219.7046 1228.4869 1299.1288 1382.9828 1392.9493 1400.0627 1469.8404 1470.2648 1474.1983 1591.4143 1594.8059 2100.0860 2983.1430 3066.4172 3096.8461 3141.9470 3143.2565 3166.8867 3169.6378
redmass: 1.0404 8.8005 5.0786 7.3277 6.8178 7.1722 6.8151 11.3940 8.8030 13.7255 5.3335 4.4466 3.7751 9.9931 2.8672 10.2163 3.2465 12.6841 6.2692 11.9690 6.9565 3.2915 4.8797 1.6386 5.1701 1.2444 1.2990 10.2400 1.4127 5.8261 1.4472 1.6041 2.4537 1.2866 1.1338 3.1271 13.9332 1.2584 6.6157 2.8741 1.2151 1.1161 2.2341 1.0715 5.9515 6.9598 12.7144 1.0393 1.0944 1.1003 1.0893 1.0895 1.0958 1.0972
irintensity: 0.6868 0.0387 0.0066 0.2081 1.0616 2.1501 1.0887 2.8075 10.8808 1.6997 27.0759 3.3189 0.2280 24.3205 0.0315 206.2596 93.2256 11.2085 30.4088 34.4442 0.1376 0.9933 1.7974 96.1830 32.9614 0.2365 1.0974 67.0443 1.3046 1.0686 5.3791 24.4280 31.1749 7.6077 14.9503 12.1353 40.7740 2.5448 1.0471 12.0977 18.9537 18.1285 22.6775 14.7735 16.8211 0.0666 1140.6069 16.5773 16.7411 13.2895 11.6056 4.1689 0.0094 8.9046
temp: 298.150 k
press: 1.00000 atm
elementType: 16 8 8 8 7 6 6 6 6 6 6 6 6 1 1 1 1 1 1 1
symmnumber: 1
zpe: 352871.4 jmol-1
zpe.correction: 0.134402 hartree
zpe.thermalcorrener: 0.147067 hartree
zpe.thermalcorrenthalpy: 0.148011 hartree
zpe.thermalcorrgfe: 0.093274 hartree
zpe.sumelectzpe: -986.413070 hartree
zpe.sumelectthermal: -986.400404 hartree
zpe.sumelectthermalent: -986.399460 hartree
zpe.sumelectthermalfe: -986.454198 hartree
dipole: -7.4404 1.4866 -0.0519
dipole: 7.5876
quadrupole: -79.8595 -91.0738 -79.4870
quadrupole: -1.2626 0.0375 0.4273
quadrupole: 3.6139 -7.6003 3.9865 -1.2626 0.0375 0.4273
hfenergy: -986.5474712 hartree
pointgroup: C01 [X(C8H7N1O3S1)]
dipole: -2.9193609 -0.0086682 0.6234584 debye
dipolederiv: 2.4515198 -0.0008429 0.2751762 -0.0030469 1.1479538 -0.0047303 0.6158751 -0.0051264 1.772186 -0.7025933 0.035728 0.0258145 -0.0442184 -0.5343706 -0.1789639 -0.0814712 -0.0330265 -0.556378 -0.7027207 -0.0364585 0.0247106 0.0445967 -0.5377457 0.1790246 -0.0805775 0.0335818 -0.5528336 -1.5687462 0.0056568 -0.6215264 0.0052019 -0.1631348 0.0019455 -0.3736767 0.001315 -0.286456 -2.018408 0.0073046 -0.9314882 0.0058634 -0.3588119 0.0039309 -0.541505 0.0026362 -0.6726082 -0.012787 -0.0001712 0.020739 -0.0009102 -0.0867522 0.0007383 0.1476206 0.0010037 -0.1829588 0.6189893 0.0015334 -0.1148966 0.001637 0.0314097 -0.0000339 -0.06256 0.0001198 0.0050579 -0.1142859 0.1061297 -0.0201954 -0.2836056 -0.0246653 0.0513261 -0.0360456 -0.0366853 -0.0609185 -0.1147708 -0.1058608 -0.0216102 0.2839306 -0.0240751 -0.0507881 -0.0319533 0.0371 -0.0611074 -0.25241 -0.1443389 0.0141119 -0.152361 0.0543645 0.0291989 0.0151905 0.0323415 -0.1442578 -0.2531452 0.14332 0.0163188 0.1510991 0.0560543 -0.0260386 0.017459 -0.0293287 -0.1450419 -0.2807566 -0.000853 0.0492252 0.0002137 0.0734358 0.0001208 -0.1002978 -0.0000981 0.0675167 2.6269379 -0.0106788 1.1791616 -0.0068976 0.2452099 -0.0020163 0.2946248 -0.0003541 0.1883477 0.1259255 -0.0622592 0.0254485 -0.0499197 0.0750282 -0.0005132 0.0082586 0.0217846 0.146873 0.1254831 0.0619344 0.0264112 0.0499486 0.0756052 -0.0004993 0.0090704 -0.0227925 0.14647 0.0004379 0.080078 0.0345206 0.0717164 -0.0215805 -0.0152351 0.0565831 -0.0238988 0.143254 0.0008889 -0.0804839 0.0332864 -0.0725655 -0.0226064 0.01284 0.055466 0.0215881 0.1438346 0.0578957 0.0018273 0.021004 -0.0640122 -0.0542973 0.1122357 0.0844623 0.0758219 0.0488069 0.0576488 -0.0018085 0.0213914 0.0629921 -0.0513647 -0.1136425 0.0855926 -0.077055 0.0460263 -0.0451032 0.0002436 -0.057603 0.0003374 0.1203434 0.0011004 -0.0821159 0.0010728 -0.0458129 unknown
polarizability: 202.5494295|0.0005889|112.6177157|3.3348625|0.1412662|88.4227824 unknown
InChI: InChI=1S/C8H7NO3S/c1-7-2-4-8(5-3-7)13(11,12)9-6-10/h2-5H,1H3
charge 0 multiplicity 1
20 atoms
S  1.412257 0.010024 -0.892472
O  1.797657 -1.392865 -1.600079
O  1.793666 1.424602 -1.578642
O  4.562397 -0.010986 1.499512
N  2.168116 -0.002488 0.92092
C  -0.389204 0.003616 -0.38889
C  -3.093037 -0.005726 0.306569
C  -1.027043 1.241177 -0.214781
C  -1.02334 -1.238328 -0.233579
C  -2.394151 1.219616 0.135599
C  -2.39051 -1.226249 0.117033
C  -4.568977 -0.010445 0.654834
C  3.403867 -0.006511 1.138143
H  -0.483693 2.180316 -0.35761
H  -0.477194 -2.173572 -0.390605
H  -2.922485 2.16856 0.279666
H  -2.91599 -2.178852 0.246619
H  -4.848047 -0.909043 1.231227
H  -4.850543 0.878802 1.244367
H  -5.186445 -0.004547 -0.264231
