program: Gaussian 09
title: 000077685
version: EM64L-G09RevD.01
frameworkgroup: C1[X(C3H2Cl2F4)]
method: RPBEPBE
basis: SDD
operation: Freq
keyword: #p
keyword: freq=noraman
keyword: PBEPBE/SDD
title: #p freq=noraman PBEPBE/SDD
converged: NO YES NO NO
title: Mulliken charges:
elementType: Cl Cl F F F F C C C H H
charge: 0.102362 0.051859 -0.150229 -0.150463 -0.181096 -0.156335 0.412941 -0.638784 0.095576 0.368809 0.245359
chargesum: 0.00000
title: Mulliken charges with hydrogens summed into heavy atoms:
elementType: Cl Cl F F F F C C C
charge: 0.102362 0.051859 -0.150229 -0.150463 -0.181096 -0.156335 0.412941 -0.269975 0.340936
polarizability: 5.57184083e+01 -4.58337656e+00 5.91379905e+01 -5.50105540e-02 4.44621961e+00 3.99950027e+01
1716.lowfreq: -5.3969 -2.7417 -0.0022 -0.0021 0.0020 6.4370 56.4239 67.8082 123.5852
frequency: 56.3909 67.7940 123.5823 186.2999 200.1074 237.4970 254.9131 308.5716 333.7586 389.3269 484.5293 517.5329 679.7641 690.9714 724.3473 798.6611 973.0111 983.7465 1025.7247 1136.0465 1144.2075 1190.4294 1253.4953 1295.7886 1325.4235 3107.1651 3148.1936
redmass: 16.6239 13.8662 17.1473 16.3680 23.1972 18.8008 17.0860 18.2544 17.3965 13.7650 10.7716 12.0006 8.9613 7.3536 8.8463 5.8972 4.9231 7.8972 7.4836 7.9414 3.6928 1.1830 1.2964 1.1604 1.4430 1.0884 1.0879
irintensity: 1.2044 2.2528 0.8015 5.5993 0.5975 1.0793 1.4175 0.9246 4.5345 4.2697 21.8261 9.8059 89.2305 18.5310 76.0093 51.9229 97.4301 139.5605 79.5420 73.8445 32.2976 4.2737 3.3046 2.4428 5.8019 9.0370 1.0611
temp: 298.150 k
press: 1.00000 atm
elementType: 17 17 9 9 9 9 6 6 6 1 1
symmnumber: 1
zpe: 135401.0 jmol-1
zpe.correction: 0.051572 hartree
zpe.thermalcorrener: 0.061025 hartree
zpe.thermalcorrenthalpy: 0.061970 hartree
zpe.thermalcorrgfe: 0.015328 hartree
zpe.sumelectzpe: -1434.276404 hartree
zpe.sumelectthermal: -1434.266950 hartree
zpe.sumelectthermalent: -1434.266006 hartree
zpe.sumelectthermalfe: -1434.312648 hartree
dipole: 0.5706 1.9182 -0.3344
dipole: 2.0290
quadrupole: -68.3457 -65.2711 -63.9538
quadrupole: -3.0355 -3.1103 2.0809
quadrupole: -2.4888 0.5857 1.9031 -3.0355 -3.1103 2.0809
hfenergy: -1434.3279756 hartree
pointgroup: C01 [X(C3H2Cl2F4)]
dipole: 0.222377 -0.7641898 0.0618649 debye
dipolederiv: -0.3832247 -0.2717297 -0.084178 -0.188266 -0.3257787 -0.0687791 -0.0231709 -0.0174206 -0.0659214 -0.1755943 0.0497336 0.0053396 -0.0459476 -0.5305311 -0.1745781 -0.0532747 -0.2374168 -0.1919085 -0.3136888 -0.0115139 0.0712481 -0.0073873 -0.3106271 0.1654064 0.0131209 0.1067539 -0.6590778 -0.3728935 0.1245253 0.0725736 0.1339824 -0.57997 -0.2563346 0.0499201 -0.143473 -0.4116138 -0.375898 -0.0594856 0.0684566 -0.0144106 -0.3826018 0.1892193 -0.0157427 0.2631657 -0.6115596 -0.7310961 0.1893631 -0.1642557 0.2043701 -0.381949 0.1173112 -0.0579182 0.0539244 -0.2778733 0.6745843 -0.1734818 -0.1268166 -0.2927763 0.7621278 0.0558186 -0.0330991 -0.0408327 1.0367208 0.5192875 0.3384553 0.0220055 0.2580657 0.9618485 0.3045935 0.0252244 0.362533 0.2455295 1.0762408 -0.1664212 0.0881873 -0.0558582 0.7889781 -0.2575946 0.0463645 -0.3100312 0.8993407 0.0304657 -0.0212569 0.0383211 -0.0109101 0.0005579 -0.0272378 0.0106355 -0.0151444 0.0402266 0.0518171 0.0018117 0.0091186 0.0191379 -0.0020547 -0.0478248 0.0379402 -0.0220582 -0.0038632 unknown
polarizability: 55.6818493|4.3742028|58.0563019|0.9373091|6.3904374|41.1132504 unknown
InChI: InChI=1S/C3H2Cl2F4/c4-1(5)3(8,9)2(6)7/h1-2H
charge 0 multiplicity 1
11 atoms
Cl 2.663356 0.799301 0.45467
Cl 1.556056 -1.902401 -0.457835
F  0.212414 0.820577 -1.436491
F  -0.322188 1.502847 0.685332
F  -1.469137 -1.165355 1.099125
F  -2.439155 0.261686 -0.419854
C  -0.036211 0.360692 -0.11472
C  1.206036 -0.328506 0.482425
C  -1.302592 -0.540926 -0.177675
H  1.023273 -0.613605 1.525223
H  -1.235452 -1.32021 -0.953599
