program: Gaussian 09
title: 000008086
version: EM64L-G09RevD.01
frameworkgroup: C1[X(C6H15NO2)]
method: RPBEPBE
basis: SDD
operation: Freq
keyword: #p
keyword: freq=noraman
keyword: PBEPBE/SDD
title: #p freq=noraman PBEPBE/SDD
converged: YES YES NO NO
title: Mulliken charges:
elementType: O O N C C C C C C H H H H H H H H H H H H H H H
charge: -0.453046 -0.460289 -0.323104 -0.380113 -0.366454 -0.040382 -0.052454 -0.694116 -0.699946 0.205613 0.197739 0.211743 0.222092 0.199544 0.175691 0.249043 0.242793 0.222396 0.198989 0.202426 0.222010 0.247708 0.332765 0.339354
chargesum: 0.00000
title: Mulliken charges with hydrogens summed into heavy atoms:
elementType: O O N C C C C C C
charge: -0.120281 -0.120935 -0.074061 0.023239 0.067381 0.159161 0.123237 -0.029939 -0.027803
polarizability: 9.85713672e+01 1.05672074e+00 7.46371000e+01 1.60212591e-01 -1.89839271e+00 6.99567303e+01
1716.lowfreq: -17.4930 -1.7237 -0.0009 -0.0006 0.0004 13.3101 41.5594 42.4887 82.9398
frequency: 40.4814 41.9783 82.9071 120.5581 161.9114 219.9051 225.2364 251.1188 258.7605 289.6420 308.1263 359.1802 374.9171 426.1198 433.2049 475.6896 526.6469 703.4106 825.6052 837.6956 903.4447 913.7664 918.1505 939.1589 1013.9715 1055.4526 1067.9825 1073.6606 1087.6001 1104.9733 1146.4302 1168.1736 1197.9889 1242.5024 1249.9398 1256.7919 1284.2342 1308.1080 1329.8348 1363.7368 1374.5613 1381.8407 1397.6116 1404.6029 1449.2415 1463.3864 1466.7666 1473.1006 1476.4257 1483.9628 1489.5478 2884.3008 2908.3682 2917.5913 2964.5917 2974.4558 2988.2899 2991.8275 3028.2366 3068.9707 3086.9878 3089.5906 3097.1244 3431.0033 3553.0018 3565.6385
redmass: 2.8549 4.1093 3.6612 2.3667 2.2163 1.3895 1.5016 1.8905 2.3106 1.0847 1.0916 2.9965 2.6570 2.4613 2.6406 2.3895 4.4085 1.2482 2.6972 2.6030 1.3308 2.2768 1.6583 1.7107 2.5612 2.0312 1.6469 1.6848 2.3008 1.4937 3.3435 2.2112 1.3397 1.2987 1.2534 1.2302 1.1775 1.2166 1.3149 1.3556 1.3041 1.3076 1.6435 1.4894 1.1703 1.0495 1.0712 1.0694 1.0763 1.0790 1.0726 1.0675 1.0707 1.0817 1.0834 1.0363 1.0363 1.0930 1.0920 1.0989 1.1000 1.0990 1.0990 1.0734 1.0660 1.0661
irintensity: 0.9332 0.3275 2.6534 3.2997 4.4098 5.2738 10.1468 5.6442 1.4265 145.7207 146.8607 15.3299 6.0337 3.1152 12.3090 4.5870 13.1339 94.1554 4.2508 5.2994 7.0227 30.1507 22.3459 15.3522 15.5176 13.4006 140.2861 0.3776 6.6941 28.2468 83.3192 5.5500 19.8159 34.2122 21.7164 3.1804 2.7075 1.3197 9.7147 0.8017 9.5016 38.7789 13.5184 22.0389 31.4285 8.2588 1.4260 18.6021 2.8246 6.1508 11.1449 66.6334 95.2158 63.8918 49.3509 27.2664 21.8010 51.0067 35.5729 41.0436 40.0139 22.2733 30.0979 0.9601 5.8855 3.3175
temp: 298.150 k
press: 1.00000 atm
elementType: 8 8 7 6 6 6 6 6 6 1 1 1 1 1 1 1 1 1 1 1 1 1 1 1
symmnumber: 1
zpe: 550282.3 jmol-1
zpe.correction: 0.209591 hartree
zpe.thermalcorrener: 0.221602 hartree
zpe.thermalcorrenthalpy: 0.222546 hartree
zpe.thermalcorrgfe: 0.171255 hartree
zpe.sumelectzpe: -442.029940 hartree
zpe.sumelectthermal: -442.017929 hartree
zpe.sumelectthermalent: -442.016985 hartree
zpe.sumelectthermalfe: -442.068276 hartree
dipole: 1.5248 1.2835 0.6807
dipole: 2.1061
quadrupole: -63.7154 -56.9694 -54.3375
quadrupole: 6.2499 -0.7960 -4.4638
quadrupole: -5.3746 1.3714 4.0032 6.2499 -0.7960 -4.4638
hfenergy: -442.2395311 hartree
pointgroup: C01 [X(C6H15N1O2)]
dipole: -0.6049263 0.5124043 -0.2410033 debye
dipolederiv: -0.7892157 0.139649 0.2826945 0.1411235 -0.5780949 0.0629795 0.2900249 0.0614417 -0.3452949 -0.7037533 -0.2978104 0.1068676 -0.3081611 -0.3757869 0.0264527 0.104273 0.0291662 -0.6267265 -0.8484125 0.0247952 0.0534324 0.0518125 -0.4935572 0.1720335 0.0460779 0.1573832 -0.2329336 0.3766237 -0.1673602 0.0473664 -0.3251812 0.2190862 -0.0579191 -0.1311418 -0.047551 0.2649744 0.4212238 0.1461773 -0.0202527 0.2578704 0.2274434 -0.0839624 0.0790251 -0.0618474 0.2581246 0.5788933 -0.110211 -0.1163123 -0.0810526 0.4958645 0.044939 -0.1540092 0.0804001 0.3948397 0.6354895 0.1826194 -0.0224997 0.172503 0.3892591 -0.0098138 -0.0271645 -0.0132098 0.4748539 -0.0139543 -0.0647305 -0.0310543 -0.0572606 -0.0376333 -0.1075468 0.0097731 -0.112493 -0.0632798 -0.0648674 -0.0151626 -0.0333116 -0.0688826 -0.0559389 0.1351379 0.0224194 0.1443883 -0.1319406 -0.0880782 0.0729469 -0.032201 0.1294953 -0.1013142 0.1058898 -0.068553 0.1653936 -0.0897593 0.0168778 -0.0381721 -0.0522853 -0.0011534 -0.026937 -0.1066547 -0.0119215 -0.1298752 -0.1064576 0.0452523 -0.0017273 0.0234535 -0.0333291 0.0057622 -0.0820179 -0.0048572 -0.1189235 -0.0912759 -0.0478377 -0.0063279 -0.0169583 -0.0886112 -0.0981861 0.1369562 0.0471444 0.1686818 -0.0966867 -0.0192755 0.0676174 -0.0398582 0.0345792 -0.0912818 0.0870497 -0.0416355 0.1045299 -0.1331708 -0.041922 -0.0580255 -0.0270545 -0.0589009 -0.1050709 -0.1077501 -0.0530076 -0.1216198 -0.1680395 0.1455701 -0.0026174 0.0083935 0.0010852 0.1937385 -0.0829141 -0.011237 -0.1624412 0.0287137 -0.081793 -0.1347407 0.0085796 -0.1151419 0.0337604 0.0157226 0.0342916 0.0237797 0.0902065 0.1051273 0.0012224 -0.0256515 0.0365277 -0.0019116 0.1360048 -0.034983 0.0770247 -0.0669024 -0.0378036 0.1476022 0.0558553 0.1360886 0.0083397 -0.0435814 0.0449702 -0.0342319 0.0597592 -0.1018029 0.1625931 -0.0068984 0.1499796 -0.0241585 0.0033608 0.0301957 -0.0115175 0.0589037 0.0885287 -0.0030025 -0.0425342 -0.0371245 -0.0120018 -0.133039 -0.0484709 -0.07315 -0.0589237 0.0120779 -0.1313258 0.068428 -0.1209661 0.0497425 0.0211847 0.0642382 0.01414 0.0872687 0.2984945 -0.0474245 -0.1544505 -0.0073549 0.2332514 -0.1629163 -0.130288 -0.1641661 0.1133735 0.1145571 0.1334155 -0.0337483 0.192055 0.1456253 0.0304044 -0.0551644 0.0246972 0.3803733 unknown
polarizability: 98.5818214|-0.9113857|74.459793|-0.1548817|2.0958614|70.1235831 unknown
InChI: InChI=1S/C6H15NO2/c1-5(8)3-7-4-6(2)9/h5-9H,3-4H2,1-2H3
charge 0 multiplicity 1
24 atoms
O  3.617297 -0.568465 -0.612558
O  -3.640256 -0.671072 0.541549
N  -0.019301 0.095763 0.21765
C  1.208252 -0.682942 -0.051678
C  -1.272223 -0.692175 0.224733
C  2.420232 0.24464 -0.302874
C  -2.499371 0.235259 0.287099
C  2.810136 1.085505 0.916617
C  -2.693189 1.0578 -0.995648
H  1.479899 -1.400695 0.760992
H  1.024971 -1.285474 -0.965561
H  -1.321812 -1.283349 -0.709469
H  -1.345319 -1.413178 1.072509
H  2.173284 0.9124 -1.15604
H  -2.380735 0.927049 1.153702
H  0.07498 0.643604 1.084575
H  3.734409 1.648068 0.701595
H  2.999955 0.433177 1.788359
H  2.017664 1.812997 1.169031
H  -3.520468 1.786775 -0.894409
H  -2.918713 0.38715 -1.845156
H  -1.76459 1.610779 -1.222865
H  3.436816 -1.114351 -1.420055
H  -4.482117 -0.157765 0.447403
