program: Gaussian 09
title: 000077646
version: EM64L-G09RevD.01
frameworkgroup: C1[X(C5H11ClSi)]
method: RPBEPBE
basis: SDD
operation: Freq
keyword: #p
keyword: freq=noraman
keyword: PBEPBE/SDD
title: #p freq=noraman PBEPBE/SDD
converged: YES YES NO NO
title: Mulliken charges:
elementType: Cl Si C C C C C H H H H H H H H H H H
charge: -0.338643 1.072476 -0.841498 -0.993674 -1.008412 -0.023427 -0.565634 0.263412 0.257428 0.254689 0.248797 0.255229 0.260266 0.255378 0.242964 0.221999 0.219839 0.218811
chargesum: 0.00000
title: Mulliken charges with hydrogens summed into heavy atoms:
elementType: Cl Si C C C C C
charge: -0.338643 1.072476 -0.320658 -0.234960 -0.249804 0.198572 -0.126984
polarizability: 1.08855140e+02 -3.99416352e+00 7.42165821e+01 -8.70903821e+00 -3.19578328e+00 7.73422699e+01
1716.lowfreq: -8.1868 0.0019 0.0028 0.0032 5.4075 18.3159 52.9729 67.2928 124.1063
frequency: 52.7117 67.2695 124.0894 132.5419 148.7317 158.9313 177.8130 206.9145 217.6413 269.4780 402.3226 421.5798 556.8387 645.7779 715.5198 749.4075 763.7658 818.5386 872.7269 889.2958 919.2348 931.9530 936.3217 1004.8192 1049.4988 1182.0647 1200.8061 1294.2588 1306.1167 1314.6586 1415.2611 1436.3803 1439.4635 1443.0288 1445.6612 1455.3554 1645.5368 2989.1376 2990.7214 2998.4497 3064.3342 3084.2920 3091.7016 3094.6077 3097.0267 3104.2432 3104.9906 3199.4073
redmass: 2.9684 3.2902 2.2557 1.1943 1.0320 3.0110 2.6849 2.9885 2.8660 2.9634 1.9165 6.1276 2.5202 2.5297 2.9626 1.6894 1.7312 1.3491 1.5908 1.4508 1.5063 2.0048 1.3565 1.1138 1.3488 1.4169 1.3531 1.2164 1.1996 1.1897 1.1324 1.0531 1.1393 1.0522 1.0480 1.0504 4.4628 1.0347 1.0344 1.0586 1.0979 1.0714 1.0971 1.0979 1.0851 1.0989 1.0987 1.1147
irintensity: 0.9905 1.0027 2.2464 0.4574 0.0867 0.9188 1.7739 4.3589 5.8318 0.4256 3.5974 53.2581 33.4969 29.8812 9.3555 1.9480 3.8546 13.5646 55.2881 123.5587 51.9473 46.1271 102.9804 17.1813 28.7610 51.4425 2.2156 0.7237 50.1169 23.6050 6.2413 3.0701 12.5393 3.8029 9.6324 13.7099 25.0577 6.4843 5.8606 7.6810 1.1138 21.6234 6.2861 10.9938 9.5297 5.0301 12.3037 25.7193
temp: 298.150 k
press: 1.00000 atm
elementType: 17 14 6 6 6 6 6 1 1 1 1 1 1 1 1 1 1 1
symmnumber: 1
zpe: 380599.3 jmol-1
zpe.correction: 0.144963 hartree
zpe.thermalcorrener: 0.155918 hartree
zpe.thermalcorrenthalpy: 0.156862 hartree
zpe.thermalcorrgfe: 0.107943 hartree
zpe.sumelectzpe: -946.047526 hartree
zpe.sumelectthermal: -946.036571 hartree
zpe.sumelectthermalent: -946.035627 hartree
zpe.sumelectthermalfe: -946.084546 hartree
dipole: -2.6077 1.7737 0.3047
dipole: 3.1685
quadrupole: -65.8585 -58.5923 -56.7181
quadrupole: 2.2524 0.0851 -1.5298
quadrupole: -5.4689 1.7974 3.6715 2.2524 0.0851 -1.5298
hfenergy: -946.192489 hartree
pointgroup: C01 [X(C5H11Cl1Si1)]
dipole: 0.8948223 -0.3902572 0.7751875 debye
dipolederiv: -0.7686842 0.0802916 -0.2053681 0.1095959 -0.4394203 0.0699655 -0.2044253 0.0667743 -0.5588087 1.7381934 -0.043599 0.1756633 -0.0748841 1.2824882 -0.0521246 -0.010922 -0.0615642 1.3524837 -0.6258638 0.0135071 -0.057053 0.1304992 -0.2401114 0.0171913 -0.0891935 0.0294597 -0.2474324 -0.3627214 -0.0137796 -0.0112671 -0.0043648 -0.3908715 -0.0632139 0.0703553 -0.0781557 -0.4009587 -0.3651946 -0.0292559 0.0102705 -0.0489095 -0.4594263 0.0372084 0.0835947 0.0576862 -0.3380522 0.2427482 0.0203848 0.1554884 -0.2095865 0.1440253 -0.0351723 0.5010815 -0.0409235 -0.0998695 -0.3177324 -0.0538929 0.1493509 -0.072778 0.0619153 -0.07707 0.0727604 -0.0674878 -0.3280542 0.0913429 0.0225376 -0.0020271 0.0377888 0.0473507 -0.0794103 -0.0847885 -0.0862401 -0.0573936 0.0466664 -0.082497 0.0142481 -0.0103494 -0.0741129 0.0723212 -0.0373262 0.0570765 0.0676567 -0.0174474 0.0059295 0.1033454 0.0321615 0.1153469 -0.0158874 0.1376047 -0.0009865 0.0206074 -0.0141515 0.021977 -0.1108842 -0.0048075 0.0998918 -0.002868 -0.1293724 0.025892 0.0107745 0.1031518 -0.0365441 0.0080274 -0.0336595 -0.0970559 0.0608394 -0.0120142 0.0343174 0.0969757 -0.0472981 -0.0222241 0.096377 -0.0525118 0.1091883 0.0267103 0.1133361 0.0121343 0.0475911 0.1165138 -0.0096445 -0.0132593 0.0040814 -0.016964 -0.1223393 -0.0211753 -0.0987932 0.0116238 0.0085498 0.0574469 -0.0932726 0.0889343 0.0576647 0.0746572 -0.1115637 0.0459195 0.020524 0.073961 -0.0149827 -0.0514918 0.0448201 -0.1340412 0.0262533 -0.0708118 0.0248604 0.1248808 -0.0091838 0.052944 -0.1160112 0.0603511 0.0465145 0.0456342 -0.1714177 0.0460048 0.1275881 0.1071499 0.0314014 -0.0521366 0.0036189 -0.112382 0.0173049 -0.035722 0.0340259 0.1498634 unknown
polarizability: 106.1672789|2.3912143|78.7578757|13.3980647|0.2073089|75.4888373 unknown
InChI: InChI=1S/C5H11ClSi/c1-4-5-7(2,3)6/h4H,1,5H2,2-3H3
charge 0 multiplicity 1
18 atoms
Cl -2.586303 0.591572 -1.21621
Si -0.874557 -0.012043 0.087358
C  0.682327 0.046586 -1.041613
C  -0.798988 1.266439 1.488074
C  -1.267228 -1.767696 0.696529
C  1.8955 -0.506505 -0.326487
C  2.898321 0.234597 0.214956
H  0.457308 -0.537535 -1.954385
H  0.841426 1.096219 -1.350173
H  -1.723323 1.238968 2.091149
H  0.060026 1.059624 2.15283
H  -0.686945 2.286849 1.081922
H  -2.219826 -1.779499 1.254554
H  -1.361174 -2.469542 -0.150482
H  -0.469223 -2.134269 1.368972
H  1.94329 -1.602912 -0.235946
H  3.742384 -0.23646 0.730608
H  2.908789 1.329506 0.144944
