program: Gaussian 09
title: 000087711
version: EM64L-G09RevD.01
frameworkgroup: C1[X(C7H9N3O2)]
method: RPBEPBE
basis: SDD
operation: Freq
keyword: #pfreq=noraman
keyword: PBEPBE/SDD
title: #p freq=noraman PBEPBE/SDD
converged: NO NO NO NO
title: Mulliken charges:
elementType: O O N N N C C C C C C C H H H H H H H H H
charge: -0.294903 -0.208307 -0.421691 -0.402329 0.055249 0.415768 0.059641 -0.428187 0.130135 -0.781653 0.205618 -0.788526 0.264009 0.341476 0.356326 0.247546 0.258126 0.247495 0.262142 0.244486 0.237579
chargesum: 0.00000
title: Mulliken charges with hydrogens summed into heavy atoms:
elementType: O O N N N C C C C C C C
charge: -0.294903 -0.208307 -0.080215 -0.046003 0.055249 0.415768 0.059641 -0.164178 0.130135 -0.028486 0.205618 -0.044319
polarizability: 1.61535467e+02 8.87739372e+00 1.14070528e+02 8.99935432e-02 8.06969722e-02 5.27696191e+01
1716.lowfreq: -67.8447 -52.5349 -11.4191 -10.5390 -0.0009 -0.0006 0.0002 9.1020 57.9115
frequency: -67.5852 -52.3691 57.8922 67.9804 115.9394 161.6310 191.8856 265.7731 287.1405 329.4730 371.4069 449.0865 487.9422 497.3748 548.1533 572.8124 595.4161 632.6236 671.1417 688.7471 760.0317 825.1350 838.4018 853.0966 902.6518 967.8898 991.1926 1011.3182 1033.4734 1048.1212 1113.7556 1175.2134 1211.4061 1253.9613 1299.8042 1375.9634 1385.8222 1405.3842 1443.5415 1451.0741 1465.4155 1467.8284 1492.0420 1502.8135 1547.9188 1555.8763 1616.6244 1651.0127 2987.6292 2991.5466 3066.1516 3077.4051 3117.1876 3137.9667 3186.2830 3351.1133 3566.9241
redmass: 1.0427 1.0486 6.2740 3.6436 5.0568 4.8309 4.1757 9.3189 3.1603 3.7093 5.7410 5.6120 4.3350 5.8059 9.0817 3.5967 3.7000 4.6258 1.1781 8.3233 2.8957 4.4640 1.3382 1.3625 4.9706 1.8899 1.9620 2.4233 1.6943 1.5074 3.7420 3.6584 2.1604 2.4334 4.1749 1.2407 1.9645 1.3752 1.2943 1.1501 1.0493 1.0428 1.4961 3.7945 3.9924 4.2035 4.7286 5.6715 1.0387 1.0379 1.0984 1.0980 1.0972 1.0987 1.0934 1.0758 1.0790
irintensity: 0.2432 1.1007 0.1788 11.7487 12.9078 1.0292 0.0172 2.0176 3.4616 2.2046 0.6634 0.2154 21.0259 12.8724 7.4522 3.0302 0.1020 4.3494 82.2799 5.5434 0.4445 4.1818 45.4713 92.9419 5.1464 7.2640 14.2888 3.9703 10.9674 10.6015 21.8211 13.4770 54.9526 68.2356 24.5310 59.4430 16.1286 30.7128 221.0081 4.0101 19.8469 18.1556 275.2227 483.8221 93.4022 102.5811 249.5618 32.0058 20.0513 5.5630 12.5595 13.7877 9.0365 9.9000 1.4749 75.9195 77.9178
temp: 298.150 k
press: 1.00000 atm
elementType: 8 8 7 7 7 6 6 6 6 6 6 6 1 1 1 1 1 1 1 1 1
symmnumber: 1
zpe: 419419.1 jmol-1
zpe.correction: 0.159748 hartree
zpe.thermalcorrener: 0.170039 hartree
zpe.thermalcorrenthalpy: 0.170984 hartree
zpe.thermalcorrgfe: 0.123140 hartree
zpe.sumelectzpe: -585.959662 hartree
zpe.sumelectthermal: -585.949370 hartree
zpe.sumelectthermalent: -585.948426 hartree
zpe.sumelectthermalfe: -585.996270 hartree
dipole: -4.3305 -0.7551 0.0466
dipole: 4.3961
quadrupole: -47.2793 -81.7287 -70.6053
quadrupole: 15.2442 0.1111 -0.0165
quadrupole: 19.2585 -15.1909 -4.0676 15.2442 0.1111 -0.0165
hfenergy: -586.1194099 hartree
pointgroup: C01 [X(C7H9N3O2)]
dipole: -1.6855992 -0.3870539 0.0183534 debye
dipolederiv: -0.6139743 -0.3074087 0.0004447 -0.2830581 -1.1106266 0.0013803 0.0007995 0.0006973 -0.3864525 -0.6917899 0.002093 -0.0008558 0.5599179 -0.8577046 -0.0057119 -0.0061912 -0.0020906 -0.3194292 -0.7025736 -0.0672714 -0.0000006 0.1634775 -0.5532484 0.0004475 0.0005238 0.0008938 -0.2204343 -2.2223331 0.174142 -0.0013923 0.5012405 -0.4513674 0.0024951 0.0004944 -0.0013371 -0.3377609 0.165827 0.3080095 -0.0005105 -0.3678403 -0.0400921 0.0002549 -0.0007891 -0.0007579 -0.1514449 0.4955626 -0.0620492 -0.0002832 -0.103589 0.8676977 -0.0010138 -0.0004882 -0.0005584 0.0510284 1.4161614 0.2483579 -0.0022809 0.4634121 -0.2699267 -0.0007663 -0.0045233 -0.000277 0.1461932 -0.343205 -0.6194717 0.0008232 -0.0842239 -0.3870839 0.000399 0.000001 0.0009373 -0.2345471 0.3268839 0.484673 -0.0009222 0.4039049 1.1226699 -0.0015302 0.0002723 -0.0012644 0.2007602 -0.1724034 -0.013592 0.000227 -0.1025645 0.0027825 0.0000894 0.0001909 0.0000543 0.0802232 2.05789 -0.1180489 0.0092783 -0.8933122 1.156962 0.0102307 0.0287321 0.0117222 0.1895549 -0.3922579 -0.1606127 -0.0053724 -0.280503 -0.1484171 -0.0146517 -0.0434152 -0.0247086 0.0488788 0.0002302 0.0569605 0.0001659 0.0688833 0.0461079 0.0000835 0.00021 -0.0000346 0.1685582 0.1525291 -0.0163562 0.0002085 0.0222279 0.2589199 0.0000655 0.0003826 -0.0001511 0.3093637 0.3224632 0.0358505 0.0004251 -0.1614369 0.2196121 0.0002764 0.00211 0.0015436 0.2975088 0.0331867 -0.0213685 0.0022917 -0.0578579 0.0327245 -0.1036342 -0.0582868 -0.111442 -0.022164 0.0244487 0.0365446 0.0000932 0.1347634 -0.0286103 -0.0000703 0.0000696 0.0000542 0.1259273 0.0333665 -0.0210794 -0.0024447 -0.0575429 0.0329186 0.1037521 0.0582862 0.1114909 -0.0225784 -0.0332967 0.051467 0.0148499 0.116443 0.034042 -0.0153522 0.0281656 -0.007355 0.1275084 0.0707709 -0.0060783 0.0283514 -0.0255662 0.0607286 -0.0867368 -0.0138825 -0.0936511 -0.0465928 0.0725135 0.0152387 -0.0430962 -0.0167756 0.0119117 0.109993 0.0073385 0.1162341 -0.0041008 unknown
polarizability: 160.4614256|11.3416866|115.1445692|0.0855862|0.0853571|52.7696191 unknown
InChI: InChI=1S/C7H9N3O2/c1-4-3-6(12)7(10-9-4)8-5(2)11/h3,8-9H,1-2H3
charge 0 multiplicity 1
21 atoms
O  -0.169279 2.419388 -0.002624
O  2.74132 -1.630038 -0.00707
N  -1.529181 -1.416635 0.002436
N  1.581806 0.416621 -0.0050
N  -0.15362 -1.236786 0.00036
C  -2.492676 -0.428392 0.00275
C  0.239609 0.044404 -0.001498
C  -2.079257 0.903023 0.001138
C  -0.676392 1.235045 -0.001351
C  -3.933628 -0.881967 0.004843
C  2.747918 -0.372354 -0.006593
C  4.026547 0.464799 0.012553
H  -2.815825 1.709192 0.001428
H  -1.788291 -2.403542 0.003417
H  1.659866 1.449231 -0.00491
H  -4.168141 -1.489601 -0.888882
H  -4.604978 -0.009964 0.005214
H  -4.165905 -1.488665 0.899789
H  4.890415 -0.205734 -0.098766
H  4.12094 1.011242 0.969258
H  4.035852 1.208532 -0.80479
