program: Gaussian 09
title: 000087687
version: EM64L-G09RevD.01
frameworkgroup: C1[X(C8H8ClNO2)]
method: RPBEPBE
basis: SDD
operation: Freq
keyword: #p
keyword: freq=noraman
keyword: PBEPBE/SDD
title: #p freq=noraman PBEPBE/SDD
converged: NO NO NO NO
title: Mulliken charges:
elementType: Cl O O N C C C C C C C C H H H H H H H H
charge: -0.061987 -0.209531 -0.201438 0.024210 0.398075 0.558412 0.202459 -0.527293 -0.355050 -0.352763 -0.769790 -0.775357 0.249649 0.251513 0.291091 0.258031 0.255534 0.215275 0.274318 0.274643
chargesum: 0.00000
title: Mulliken charges with hydrogens summed into heavy atoms:
elementType: Cl O O N C C C C C C C C
charge: -0.061987 -0.209531 -0.201438 0.024210 0.398075 0.558412 0.202459 -0.277643 -0.103537 -0.061672 -0.040950 -0.226397
polarizability: 1.67965581e+02 -1.20056526e+00 1.17028167e+02 4.10190479e+00 -7.93622965e-01 6.36731834e+01
1716.lowfreq: -21.5845 -18.1850 -8.6644 -5.8810 0.0025 0.0027 0.0037 28.8666 59.5834
frequency: -19.6409 28.8422 59.5435 137.5070 206.8479 225.6874 230.7022 298.1393 301.0145 367.8358 382.5943 439.0656 506.3492 532.0354 563.5992 610.2551 628.4029 680.9273 724.4243 745.0081 769.3874 856.0326 903.3266 904.3260 951.5819 989.5076 1015.3713 1040.4145 1057.4173 1122.1072 1157.9467 1178.0642 1204.1132 1248.4626 1254.3076 1289.4876 1357.5305 1379.4602 1408.6741 1428.2634 1450.2432 1462.6095 1466.3581 1480.6759 1586.7070 1620.8292 3000.8724 3071.5801 3081.3496 3108.9362 3133.2647 3149.9112 3154.2507 3187.9389
redmass: 8.5090 5.4799 11.2083 5.9516 2.9555 4.2302 1.1598 3.2564 5.6979 7.0832 4.0906 3.0923 4.4274 5.1504 5.4125 6.4197 6.0866 3.8121 5.5051 4.5819 9.3745 1.4413 1.5108 1.5454 2.7946 1.3416 1.5282 1.5625 5.2466 1.1163 1.4800 1.7012 8.8841 1.2517 2.1154 1.7548 5.1213 3.5017 1.4301 3.6713 1.0455 1.1455 1.5897 1.6854 7.1242 6.6419 1.0366 1.0574 1.0954 1.1019 1.0920 1.0920 1.1107 1.0946
irintensity: 0.0741 3.2360 2.4558 4.3938 1.7154 0.5360 0.4414 2.3065 0.6852 9.0105 0.0247 3.5113 2.1082 12.7595 2.1010 3.1133 24.1301 39.9787 13.1053 1.2567 40.7724 24.3617 3.9856 5.1464 1.0352 1.0080 4.1317 10.4987 6.2529 3.5130 16.4481 49.9338 257.7785 6.3783 8.8415 12.3704 87.9595 62.9825 13.0386 15.9732 12.7972 6.5955 28.2258 3.7574 16.2686 21.2624 8.6951 18.0274 5.9690 22.4093 9.9974 3.5486 6.7218 3.5611
temp: 298.150 k
press: 1.00000 atm
elementType: 17 8 8 7 6 6 6 6 6 6 6 6 1 1 1 1 1 1 1 1
symmnumber: 1
zpe: 383642.9 jmol-1
zpe.correction: 0.146122 hartree
zpe.thermalcorrener: 0.156518 hartree
zpe.thermalcorrenthalpy: 0.157462 hartree
zpe.thermalcorrgfe: 0.108532 hartree
zpe.sumelectzpe: -973.955274 hartree
zpe.sumelectthermal: -973.944879 hartree
zpe.sumelectthermalent: -973.943934 hartree
zpe.sumelectthermalfe: -973.992864 hartree
dipole: 3.1639 1.1156 2.5356
dipole: 4.2052
quadrupole: -98.9601 -70.6397 -76.3664
quadrupole: -4.5304 4.6181 -0.5565
quadrupole: -16.9713 11.3490 5.6223 -4.5304 4.6181 -0.5565
hfenergy: -974.1013961 hartree
pointgroup: C01 [X(C8H8Cl1N1O2)]
dipole: -1.3018454 -0.4347238 0.9238418 debye
dipolederiv: -0.6341528 -0.0089608 -0.1294976 -0.0260565 -0.1660465 -0.0059646 -0.4378698 -0.0106887 -0.3955301 -0.6840244 -0.225259 0.0364704 -0.2537796 -0.7617705 0.0155078 0.0569712 0.0292774 -0.2374297 -0.7502697 0.1830451 0.0439982 0.1919289 -0.6210775 -0.0114719 0.066696 -0.0231674 -0.2174179 1.770782 0.1480298 -0.1305739 0.1356615 1.1554505 -0.0102645 -0.1967808 -0.0187546 0.1997691 0.254826 -0.3500579 -0.0090729 0.0674671 0.2746218 -0.0147958 -0.0311555 0.0453307 0.0402535 0.0997059 0.0048807 0.0246784 0.05031 0.1866442 -0.0022755 0.1469774 0.0044207 -0.082866 -0.7263149 -0.1140699 0.0403853 -0.0301955 -0.0378079 -0.0000289 0.0919964 0.0134915 0.014681 -0.2692558 0.3281311 -0.0162469 0.1455155 -0.0555935 -0.0184472 0.0277317 -0.0348385 -0.1497934 -0.2538229 -0.2403986 -0.0126409 -0.1760715 -0.0246778 0.020066 0.0302896 0.0200567 -0.1464875 0.1701191 0.1761879 -0.0199107 -0.1718822 -0.0987257 0.0241664 -0.0330643 -0.0252078 -0.0734272 0.0029331 0.2832547 -0.0006861 0.1111278 -0.0824516 -0.0145134 0.0044499 -0.0354153 0.0175364 0.745887 0.0099312 0.2021174 0.0343354 0.1780116 0.0085854 0.3192583 0.0093523 0.5332979 0.0470762 -0.0607829 0.0181703 -0.0788282 -0.0426218 0.0077622 0.010097 0.005233 0.1327561 0.0232916 0.0835827 0.0213145 0.0777064 -0.0089738 -0.0059197 0.0130379 -0.0074103 0.1428123 0.1165303 -0.0572512 0.0037816 -0.0147596 0.0633182 0.0018794 0.0057762 0.0068442 0.1652364 0.0617196 0.0059225 0.0760329 -0.0022992 0.0639165 0.0155754 0.0723889 -0.0146536 -0.0218139 0.0213622 0.0109846 -0.0908301 -0.0046075 0.0627893 -0.0142783 -0.0851691 0.0150367 0.0165308 -0.0151912 -0.1864547 0.0178536 -0.0572842 -0.0540635 0.0084121 0.0137249 0.0234626 0.1023568 0.0040822 0.009431 -0.0322019 0.0747826 -0.0109884 -0.090163 -0.0341553 -0.0548423 -0.0207018 0.0147164 -0.0001462 -0.0431414 -0.0730711 -0.0199538 0.0861678 -0.0412007 0.0524726 -0.0197627 unknown
polarizability: 168.0841147|-1.2233884|117.0333209|2.1295171|0.4620142|63.5494955 unknown
InChI: InChI=1S/C8H8ClNO2/c1-6-4-7(5-9)2-3-8(6)10(11)12/h2-4H,5H2,1H3
charge 0 multiplicity 1
20 atoms
Cl -4.162172 -0.006804 -1.135052
O  2.93384 1.633231 -0.211348
O  3.224303 -0.617758 -0.244562
N  2.470597 0.427579 -0.149244
C  0.400882 -1.041225 0.101712
C  -1.784921 0.122614 0.371132
C  1.002023 0.250929 0.026478
C  -1.006678 -1.054085 0.276724
C  -1.14065 1.383729 0.286546
C  0.248987 1.445956 0.115567
C  1.130633 -2.364302 0.012107
C  -3.270497 0.034882 0.557628
H  -1.510217 -2.02645 0.333839
H  -1.728099 2.305651 0.348739
H  0.781886 2.397342 0.04866
H  1.682831 -2.458418 -0.938727
H  1.898057 -2.45986 0.799356
H  0.412946 -3.195381 0.099163
H  -3.694503 0.915109 1.059682
H  -3.590649 -0.89334 1.0498
