program: Gaussian 09
title: 000087671
version: EM64L-G09RevD.01
frameworkgroup: C1[X(C10H20O)]
method: RPBEPBE
basis: SDD
operation: Freq
keyword: #pfreq=noraman
keyword: PBEPBE/SDD
title: #p freq=noraman PBEPBE/SDD
converged: YES YES NO NO
title: Mulliken charges:
elementType: O C C C C C C C C C C H H H H H H H H H H H H H H H H H H H H
charge: -0.457199 0.307686 -0.441684 -0.390568 -0.568127 -0.733858 -0.733544 0.628582 -0.545281 -0.692865 -0.790108 0.197169 0.193957 0.237345 0.213043 0.204892 0.200666 0.226008 0.198165 0.243147 0.212931 0.202570 0.236101 0.213900 0.211971 0.323332 0.225683 0.214835 0.217663 0.222589 0.221002
chargesum: 0.00000
title: Mulliken charges with hydrogens summed into heavy atoms:
elementType: O C C C C C C C C C C
charge: -0.133868 0.307686 -0.050559 0.059819 -0.162569 -0.066538 -0.081942 0.628582 -0.119410 -0.034684 -0.346518
polarizability: 1.27905204e+02 -8.48762067e+00 1.16667297e+02 -6.55073899e+00 -6.75534976e-02 9.28812978e+01
1716.lowfreq: -26.1243 -13.1473 -8.4267 -0.0005 -0.0005 -0.0003 18.5636 30.7215 67.3572
frequency: 17.2180 30.2100 67.3295 87.6233 109.0150 133.0178 196.4236 203.6530 226.4864 237.7077 250.9590 265.7311 311.8286 336.8729 347.8547 401.2094 420.9835 433.5508 468.3533 513.3648 580.7296 703.4905 733.9548 749.8055 782.9176 791.0840 835.3683 872.6643 920.3494 930.7929 939.9742 947.6757 983.6037 1010.8141 1032.5257 1035.7984 1060.1807 1067.8280 1080.9376 1108.8019 1126.0950 1184.3138 1218.1261 1244.5910 1248.9860 1261.5539 1285.4713 1303.7279 1317.5248 1324.3988 1342.6039 1357.5773 1376.1626 1385.5610 1393.3698 1432.1984 1446.3076 1458.6750 1461.2954 1464.8157 1470.1866 1473.9645 1477.8126 1479.8249 1488.6686 1489.4304 1658.8226 2942.4921 2950.6834 2969.6395 2969.8112 2978.6860 2985.4509 2993.9496 2999.7530 3013.6236 3030.9026 3054.7179 3062.0410 3074.6295 3079.6835 3081.3739 3085.1043 3093.2364 3102.0228 3183.4194 3540.2298
redmass: 3.2131 3.0109 3.1849 2.7559 2.0678 1.9606 1.3241 1.4153 1.9214 1.2323 1.6074 2.5161 1.2175 1.9477 2.6015 2.1703 2.2219 2.5583 2.4879 3.0071 2.7239 1.2659 2.6359 1.2239 2.0485 1.3159 1.4754 2.4391 1.6040 1.7033 1.4287 1.6834 1.3702 1.5239 2.4536 2.3599 1.9199 1.8736 1.8157 1.5714 1.3395 1.9205 2.0824 1.4252 1.3308 1.3468 1.1777 1.6139 1.5000 1.6606 1.6520 1.5059 1.3003 1.2082 1.2623 1.1568 1.0661 1.0828 1.0705 1.0606 1.0724 1.0741 1.0486 1.0828 1.0658 1.0623 5.2196 1.0612 1.0623 1.0381 1.0611 1.0358 1.0600 1.0373 1.0950 1.0956 1.0975 1.1036 1.0980 1.0994 1.1010 1.0624 1.1000 1.0993 1.0994 1.1136 1.0656
irintensity: 0.7018 0.0045 0.4384 0.6507 0.1644 0.5157 3.2586 0.1244 0.7046 2.9281 1.2772 0.4257 73.8970 88.9636 4.8276 0.6823 5.2578 5.0237 7.1316 5.8783 10.3221 0.3503 3.1467 6.1616 2.0002 6.3663 1.2740 20.9424 8.3523 12.6900 63.6880 11.4452 2.3715 8.1426 3.3157 0.1237 4.7968 0.7204 3.3411 49.7926 2.6772 32.5722 25.5209 27.2080 13.9522 11.0095 3.8166 5.0786 3.8011 3.5394 7.8792 7.3502 34.4787 12.0280 21.0394 1.6494 0.9970 4.1711 4.5942 5.9772 10.3164 4.7161 9.2993 19.2237 9.4193 10.8614 32.6123 19.0909 33.7459 38.2644 15.7953 30.9701 35.0774 14.4451 22.5804 16.9631 15.5915 38.1569 60.6742 60.6974 46.8654 10.6827 5.3920 57.9421 31.6487 29.3855 4.4429
temp: 298.150 k
press: 1.00000 atm
elementType: 8 6 6 6 6 6 6 6 6 6 6 1 1 1 1 1 1 1 1 1 1 1 1 1 1 1 1 1 1 1 1
symmnumber: 1
zpe: 727282.9 jmol-1
zpe.correction: 0.277007 hartree
zpe.thermalcorrener: 0.291604 hartree
zpe.thermalcorrenthalpy: 0.292548 hartree
zpe.thermalcorrgfe: 0.234513 hartree
zpe.sumelectzpe: -467.345521 hartree
zpe.sumelectthermal: -467.330924 hartree
zpe.sumelectthermalent: -467.329980 hartree
zpe.sumelectthermalfe: -467.388015 hartree
dipole: -0.3307 0.3339 1.8252
dipole: 1.8847
quadrupole: -72.3249 -66.9114 -75.0334
quadrupole: 2.6785 -6.2359 -1.7616
quadrupole: -0.9017 4.5118 -3.6102 2.6785 -6.2359 -1.7616
hfenergy: -467.6225283 hartree
pointgroup: C01 [X(C10H20O1)]
dipole: 0.107288 -0.2460909 0.6912018 debye
polarizability: 126.4460742|-10.1315114|117.475984|5.7233758|3.1333408|93.5317401 unknown
InChI: InChI=1S/C10H20O/c1-5-9(2)7-6-8-10(3,4)11/h11H,2,5-8H2,1,3-4H3
charge 0 multiplicity 1
31 atoms
O  2.809528 0.88161 -0.957593
C  2.572441 -0.259621 -0.025742
C  1.270309 -0.004661 0.785311
C  -0.011996 0.142417 -0.061168
C  -1.219365 0.601042 0.800555
C  2.470354 -1.482069 -0.953929
C  3.779735 -0.389911 0.93114
C  -2.515668 0.785223 0.017901
C  -3.056974 -0.416099 -0.752011
C  -3.326278 -1.659206 0.135481
C  -3.169283 1.978481 0.007882
H  1.140682 -0.828052 1.518128
H  1.414936 0.921091 1.384669
H  0.167336 0.873001 -0.872954
H  -0.249406 -0.823944 -0.546309
H  -0.962717 1.553922 1.303773
H  -1.374497 -0.145982 1.608664
H  3.43773 -1.654766 -1.456635
H  2.200803 -2.387894 -0.381527
H  1.710496 -1.313947 -1.734796
H  3.689667 -1.287646 1.570271
H  3.856265 0.491337 1.597982
H  4.715316 -0.467669 0.350007
H  -2.337619 -0.699595 -1.547806
H  -3.99216 -0.125096 -1.266193
H  2.934262 1.702795 -0.41461
H  -4.043438 -1.419649 0.941485
H  -2.398381 -2.032164 0.606689
H  -3.749609 -2.483288 -0.46747
H  -2.786684 2.850034 0.553127
H  -4.104584 2.118308 -0.547818
