program: Gaussian 09
title: 000087650
version: EM64L-G09RevD.01
frameworkgroup: C1[X(C9H20O)]
method: RPBEPBE
basis: SDD
operation: Freq
keyword: #pfreq=noraman
keyword: PBEPBE/SDD
title: #p freq=noraman PBEPBE/SDD
converged: YES YES NO NO
title: Mulliken charges:
elementType: O C C C C C C C C C H H H H H H H H H H H H H H H H H H H H
charge: -0.434200 -0.013853 -0.439250 -0.059981 -0.386320 -0.746164 -0.383379 -0.366586 -0.728428 -0.691995 0.211117 0.193952 0.191747 0.200835 0.187225 0.194957 0.213087 0.210041 0.213343 0.208567 0.203000 0.190202 0.212288 0.239495 0.205540 0.214863 0.207000 0.210246 0.215473 0.327179
chargesum: 0.00000
title: Mulliken charges with hydrogens summed into heavy atoms:
elementType: O C C C C C C C C C
charge: -0.107020 0.197264 -0.053551 0.140854 -0.004138 -0.109693 0.028187 0.035904 -0.068530 -0.059276
polarizability: 1.10740764e+02 8.09955596e-02 1.02127618e+02 -1.20756290e+00 -1.26309831e+00 8.99637060e+01
1716.lowfreq: -9.6906 0.0003 0.0006 0.0007 16.7877 25.9287 50.5882 59.2060 74.7678
frequency: 50.2210 58.9234 74.6850 113.4294 136.0592 165.0069 204.9693 213.2111 229.0639 240.5462 260.8936 289.6351 314.4295 322.9988 351.6940 415.5667 441.6363 533.3313 546.6054 737.1723 791.2779 822.6653 852.6134 875.4924 896.9209 904.7272 930.2042 972.1091 975.3518 1007.2871 1011.1775 1048.2158 1055.4837 1086.7169 1110.7898 1148.3059 1152.5042 1176.0366 1192.3163 1229.6804 1248.3231 1277.2848 1287.5286 1294.4075 1309.8375 1330.7689 1340.5575 1347.9840 1361.6033 1362.9310 1369.2845 1385.1651 1387.7382 1389.7269 1461.8919 1466.2120 1470.4309 1475.5762 1476.6741 1477.0274 1477.6230 1482.1596 1486.8293 1489.3709 2937.9923 2947.1358 2950.7152 2954.4179 2967.1293 2970.0843 2971.7098 2973.6463 2978.9771 3000.0986 3006.2824 3031.1705 3060.1915 3064.1445 3065.9375 3068.0508 3068.6923 3070.4591 3081.8929 3555.9106
redmass: 3.4183 2.6604 1.7583 2.6059 2.9942 2.1351 1.9252 1.1707 1.2677 1.1526 2.2287 2.1468 2.2236 1.5088 2.5655 2.2729 1.9082 2.8013 2.3832 1.1162 2.7174 2.0368 1.4742 1.7605 1.4756 1.2985 2.0868 1.8736 2.5684 1.3254 1.8150 2.1557 1.6110 1.6776 1.8274 2.1225 2.2049 1.9900 1.6226 1.4640 1.2797 1.1658 1.3638 1.1411 1.2344 1.4455 1.3968 1.3341 1.4569 1.4337 1.2254 1.2198 1.2252 1.2230 1.0799 1.0631 1.0739 1.0546 1.0525 1.0602 1.0501 1.0546 1.0569 1.0779 1.0785 1.0683 1.0644 1.0634 1.0612 1.0357 1.0475 1.0403 1.0592 1.0988 1.0994 1.1019 1.0969 1.0992 1.0992 1.0990 1.0989 1.0995 1.0995 1.0660
irintensity: 0.7584 0.7851 0.1449 3.6316 0.7462 0.0374 0.0412 0.0227 1.1775 1.9619 5.8908 17.2921 53.6746 62.3612 0.3415 14.1426 13.9502 7.3214 3.2589 9.4438 1.1653 3.9270 1.1687 4.4259 2.5283 14.8716 2.9825 56.4996 60.6367 4.3857 0.0611 0.5293 4.3516 4.7757 16.6892 1.5084 1.7431 11.7076 4.6892 3.1610 0.8994 4.4759 3.1159 0.4816 3.0634 1.8015 1.4812 4.8662 5.5180 0.3046 22.5421 11.7770 17.9035 16.3813 1.6041 6.7178 3.2774 2.2603 8.4101 10.5261 6.3507 1.7006 16.0455 28.1833 16.2172 32.0208 65.0061 15.4130 28.3804 57.3319 25.5271 27.8790 46.1389 12.7561 65.7284 33.0531 10.3181 37.3542 40.0929 109.9110 69.1798 60.0906 26.4887 5.9837
temp: 298.150 k
press: 1.00000 atm
elementType: 8 6 6 6 6 6 6 6 6 6 1 1 1 1 1 1 1 1 1 1 1 1 1 1 1 1 1 1 1 1
symmnumber: 1
zpe: 718486.3 jmol-1
zpe.correction: 0.273657 hartree
zpe.thermalcorrener: 0.287124 hartree
zpe.thermalcorrenthalpy: 0.288068 hartree
zpe.thermalcorrgfe: 0.234002 hartree
zpe.sumelectzpe: -429.306541 hartree
zpe.sumelectthermal: -429.293075 hartree
zpe.sumelectthermalent: -429.292130 hartree
zpe.sumelectthermalfe: -429.346196 hartree
dipole: 2.1030 -0.1897 -0.1937
dipole: 2.1204
quadrupole: -79.2154 -62.3336 -65.8809
quadrupole: -1.2467 0.0970 0.0088
quadrupole: -10.0721 6.8097 3.2624 -1.2467 0.0970 0.0088
hfenergy: -429.5801981 hartree
pointgroup: C01 [X(C9H20O1)]
dipole: -0.826933 -0.0841402 0.0709231 debye
polarizability: 110.7554406|0.0118479|102.1174492|-1.0965212|1.2947071|89.9591977 unknown
InChI: InChI=1S/C9H20O/c1-4-5-8(2)6-9(3)7-10/h8-10H,4-7H2,1-3H3
charge 0 multiplicity 1
30 atoms
O  3.55269 -1.228574 0.315126
C  -0.949604 1.196739 -0.24576
C  0.333665 0.888464 0.574823
C  1.385744 -0.014601 -0.122853
C  -1.710795 -0.07936 -0.710665
C  -1.868761 2.156894 0.549093
C  -2.188708 -1.030291 0.412763
C  2.572361 -0.260029 0.838565
C  1.885024 0.571048 -1.463008
C  -2.978253 -2.237081 -0.14084
H  -0.637748 1.732755 -1.166952
H  0.040215 0.427569 1.541851
H  0.819257 1.854371 0.831767
H  0.91708 -1.003665 -0.326038
H  -2.595272 0.240219 -1.30092
H  -1.072018 -0.654863 -1.412183
H  -1.344729 3.103096 0.781167
H  -2.188719 1.711445 1.509768
H  -2.779325 2.406646 -0.02748
H  -2.826116 -0.475488 1.128769
H  -1.317841 -1.398969 0.990558
H  2.195832 -0.586839 1.832804
H  3.157073 0.66693 0.97479
H  2.741849 -0.015501 -1.839894
H  2.221288 1.617609 -1.329046
H  1.095777 0.565474 -2.236082
H  -2.36048 -2.828058 -0.843847
H  -3.878415 -1.902065 -0.69008
H  -3.308788 -2.913168 0.669174
H  3.094918 -2.097709 0.185032
