program: Gaussian 09
title: 000087655
version: EM64L-G09RevD.01
frameworkgroup: C1[X(C8H16O4Si)]
method: RPBEPBE
basis: SDD
operation: Freq
keyword: #p
keyword: freq=noraman
keyword: PBEPBE/SDD
title: #p freq=noraman PBEPBE/SDD
converged: YES YES NO NO
title: Mulliken charges:
elementType: Si O O O O C C C C C C C C H H H H H H H H H H H H H H H H
charge: 1.379385 -0.546442 -0.257070 -0.253076 -0.236075 -1.034974 -1.035636 -1.030243 0.291737 -0.588253 0.282671 -0.222841 -0.674891 0.245649 0.236837 0.278941 0.237069 0.244682 0.278282 0.252688 0.251684 0.234819 0.265530 0.263518 0.226787 0.236539 0.210730 0.234776 0.227178
chargesum: 0.00000
title: Mulliken charges with hydrogens summed into heavy atoms:
elementType: Si O O O O C C C C C C C C
charge: 1.379385 -0.546442 -0.257070 -0.253076 -0.236075 -0.273547 -0.275603 -0.291052 0.291737 -0.059205 0.282671 0.240485 -0.002208
polarizability: 1.45522836e+02 -4.07853648e+00 1.15480389e+02 -5.69309573e+00 -3.85015864e-01 1.07208068e+02
1716.lowfreq: -10.8166 -0.0015 -0.0015 -0.0013 3.4844 11.9546 16.2073 24.3766 50.5746
frequency: 14.6240 24.3094 50.5290 61.0389 67.8319 77.2762 111.7384 113.2686 136.9062 147.6462 166.5864 175.2783 183.1302 188.5706 202.2401 234.6784 259.3192 260.0221 289.5624 344.1850 393.2825 543.1492 552.0473 572.5660 623.9673 662.4877 711.0098 715.5737 755.8300 762.4665 789.2060 800.2855 818.5135 820.0908 893.3734 919.0594 921.7228 929.4123 938.8270 948.8847 1028.5913 1114.1867 1131.2067 1136.8742 1167.4714 1243.1025 1251.4630 1300.6084 1302.7813 1305.9198 1317.1771 1359.3988 1401.7727 1425.3806 1433.8973 1445.4382 1446.3843 1446.4967 1451.6994 1463.7903 1464.7723 1474.3299 1486.8713 1615.5533 1650.7741 2987.7362 2988.8426 2990.6557 2996.1210 3011.5503 3037.1065 3070.7879 3087.3683 3088.1331 3092.7047 3092.7781 3100.0752 3104.4275 3106.3615 3107.5978 3108.2857
redmass: 4.2124 3.3686 4.7328 2.5903 4.9783 5.0976 1.8582 1.2989 1.0439 1.0306 2.6520 3.0108 2.9410 2.5947 2.7299 3.3205 3.2002 1.7485 4.6868 3.7499 2.4229 4.2880 5.8508 5.9314 4.5958 6.6363 2.7872 2.7974 1.1726 7.4727 3.3184 1.1062 1.4084 1.4617 4.4433 1.5636 1.5573 1.8627 2.6858 3.1221 2.6088 2.2202 1.7822 1.4684 3.1171 2.1307 1.1381 1.8697 1.2037 1.2182 1.1932 1.4009 1.2665 1.1157 1.0521 1.0482 1.0492 1.0529 1.0513 1.0401 1.0477 1.0612 1.0678 9.4525 10.6003 1.0349 1.0349 1.0348 1.0358 1.0583 1.0598 1.1064 1.0974 1.0975 1.0983 1.0978 1.0985 1.1013 1.0991 1.0986 1.1028
irintensity: 0.6676 0.8523 1.3774 0.7643 1.7204 0.4083 2.1202 1.0585 0.0482 0.0253 2.4719 2.9034 4.5997 1.1118 2.3089 13.9032 12.2353 4.4544 10.2688 13.1148 0.8655 5.3983 4.1686 9.2150 6.8129 47.6798 8.6095 9.7611 0.0460 26.0261 4.7716 3.2165 19.2071 18.6816 10.2954 170.8075 110.3942 145.2121 90.1076 94.4022 99.9151 11.7622 232.3127 5.4806 357.8032 113.3544 1.5735 241.6511 57.2660 62.0364 12.4733 3.9405 23.0289 46.1594 0.0861 11.3019 8.6119 1.1911 3.3967 9.3289 31.0490 2.9967 14.3037 159.9860 213.3912 9.3011 6.0461 10.7065 20.5357 18.4224 2.8532 6.4346 3.8322 12.0912 35.9999 18.2300 11.9572 1.2240 3.8529 7.8658 43.7018
temp: 298.150 k
press: 1.00000 atm
elementType: 14 8 8 8 8 6 6 6 6 6 6 6 6 1 1 1 1 1 1 1 1 1 1 1 1 1 1 1 1
symmnumber: 1
zpe: 604215.7 jmol-1
zpe.correction: 0.230134 hartree
zpe.thermalcorrener: 0.248341 hartree
zpe.thermalcorrenthalpy: 0.249285 hartree
zpe.thermalcorrgfe: 0.181238 hartree
zpe.sumelectzpe: -903.761766 hartree
zpe.sumelectthermal: -903.743558 hartree
zpe.sumelectthermalent: -903.742614 hartree
zpe.sumelectthermalfe: -903.810661 hartree
dipole: 2.0298 1.8781 -1.6897
dipole: 3.2407
quadrupole: -67.8156 -88.6086 -87.5676
quadrupole: -6.1054 3.3561 2.8101
quadrupole: 13.5150 -7.2780 -6.2370 -6.1054 3.3561 2.8101
hfenergy: -903.9918991 hartree
pointgroup: C01 [X(C8H16O4Si1)]
dipole: 0.7697993 -0.4029841 -0.9330818 debye
polarizability: 145.9705954|-5.7526167|107.3780141|0.9876264|-1.6657254|114.8626841 unknown
InChI: InChI=1S/C8H16O4Si/c1-5-11-7(9)6-8(10)12-13(2,3)4/h5-6H2,1-4H3
charge 0 multiplicity 1
29 atoms
Si 3.104131 -0.102605 -0.120054
O  1.6142 -0.988891 0.41595
O  -2.698656 -0.704729 0.064861
O  0.173932 0.831497 0.399905
O  -2.479862 -0.391285 2.365679
C  3.491746 1.222725 1.183307
C  2.7563 0.619214 -1.84139
C  4.367732 -1.515632 -0.145702
C  0.389142 -0.388909 0.594693
C  -0.647091 -1.413203 1.065501
C  -2.015772 -0.788147 1.274239
C  -4.022053 -0.007283 0.106176
C  -4.556716 0.006117 -1.321683
H  3.624831 0.769636 2.181966
H  4.422953 1.762425 0.928348
H  2.668941 1.955759 1.240716
H  3.652809 1.12739 -2.24305
H  2.468901 -0.175821 -2.552488
H  1.93357 1.352585 -1.787568
H  4.461431 -1.97475 0.85427
H  4.058446 -2.303983 -0.854463
H  5.365987 -1.151943 -0.451169
H  -0.2948 -1.849849 2.014705
H  -0.695335 -2.219284 0.313847
H  -4.681165 -0.555541 0.803607
H  -3.859074 1.008112 0.50962
H  -5.534153 0.521439 -1.349705
H  -3.863284 0.538689 -1.994414
H  -4.69399 -1.020334 -1.702902
