program: Gaussian 09
title: 000087662
version: EM64L-G09RevD.01
frameworkgroup: C1[X(C21H24N2O3)]
method: RPBEPBE
basis: SDD
operation: Freq
keyword: #p
keyword: freq=noraman
keyword: PBEPBE/SDD
title: #p freq=noraman PBEPBE/SDD
converged: YES YES NO NO
title: Mulliken charges:
elementType: O O O N N C C C C C C C C C C C C C C C C C C C C C H H H H H H H H H H H H H H H H H H H H H H H H
charge: -0.308124 -0.448382 -0.447167 -0.114341 -0.154695 -0.385521 -0.376223 -0.353060 -0.354252 0.187591 0.152876 -0.003731 -0.331252 -0.329297 0.309511 0.326737 -0.397233 -0.385599 -0.398323 -0.387665 -0.235054 -0.235093 -0.240089 -0.240139 -0.252634 -0.248516 0.246667 0.204453 0.206922 0.236329 0.250040 0.209153 0.215449 0.241987 0.181857 0.197336 0.184348 0.193051 0.262435 0.249245 0.259760 0.264157 0.344016 0.344880 0.227758 0.224286 0.226599 0.224116 0.228111 0.226721
chargesum: 0.00000
title: Mulliken charges with hydrogens summed into heavy atoms:
elementType: O O O N N C C C C C C C C C C C C C C C C C C C C C
charge: -0.308124 -0.104366 -0.102287 -0.114341 -0.154695 0.065598 0.067028 0.106133 0.103184 0.187591 0.152876 -0.003731 0.047940 0.048102 0.309511 0.326737 -0.134798 -0.136353 -0.138563 -0.123508 -0.007296 -0.010806 -0.013490 -0.016022 -0.024523 -0.021796
polarizability: 3.32277228e+02 -9.78299717e+00 3.43693579e+02 -4.53345389e+00 1.94406136e+01 1.51873790e+02
1716.lowfreq: -2.1095 -0.0004 -0.0003 -0.0002 3.9979 4.3322 18.2389 19.4127 21.5920
frequency: 18.2329 19.2350 21.5827 32.9391 37.4575 48.8667 65.4071 71.4618 78.3990 79.9811 92.8323 107.1760 112.1822 133.9777 155.9718 178.0856 206.7196 228.0994 235.1510 241.1361 266.2271 270.8842 273.7018 280.3663 308.0597 360.9389 381.5406 401.9041 408.2242 419.0625 429.6755 459.8969 491.6869 510.3717 543.4743 613.5759 615.0775 628.9322 646.2579 661.4723 664.2206 688.2267 696.8365 702.9540 717.5947 767.6601 776.0154 778.6240 783.5445 847.8019 858.6012 866.7469 872.6462 884.5375 920.2214 928.7959 932.4710 964.1152 973.2025 976.6645 983.5518 985.9023 988.5762 990.4396 993.1896 996.7004 1006.0079 1017.8376 1020.7670 1026.8117 1033.2799 1048.7026 1051.9048 1077.3038 1081.2965 1098.0901 1118.4786 1143.1281 1167.7942 1171.5596 1172.4624 1187.3040 1188.9655 1194.6466 1217.4706 1218.3747 1221.3051 1242.4239 1274.4464 1282.7192 1287.5952 1294.8610 1296.3025 1316.0344 1318.0079 1321.9941 1349.4182 1364.1098 1369.2245 1375.9635 1380.4812 1385.1162 1422.4016 1423.1070 1434.8315 1438.0566 1461.0857 1467.4031 1469.8685 1474.1947 1476.7059 1488.5579 1489.2692 1494.4088 1569.9655 1579.2670 1586.2299 1612.0344 1613.9948 1643.6268 2925.5946 2926.0553 2973.1210 2976.0522 2987.1127 2992.3730 3006.8532 3009.0693 3050.8757 3055.2471 3080.9251 3083.1074 3123.1780 3124.4404 3133.2388 3133.9588 3148.3825 3150.7623 3158.2715 3160.0701 3168.2094 3169.0680 3565.7474 3565.9619
redmass: 5.8263 5.7836 5.9281 4.7246 4.6211 4.5372 2.0554 1.8651 5.1580 4.2111 3.4107 2.8746 2.9300 6.6272 4.9475 4.9008 3.1844 4.3665 4.6807 5.5070 2.6533 1.3127 1.1783 3.7913 2.9241 6.5633 6.8699 2.8387 2.9071 3.9125 3.7441 4.4237 3.5851 4.7018 4.2673 6.2550 6.3793 5.1906 5.3876 8.2734 6.8522 6.9212 1.8103 1.8379 5.8203 1.8315 1.9716 1.1121 1.1264 1.2504 1.2570 1.9218 1.3139 2.4300 1.4550 3.6547 1.7900 5.4134 6.7348 1.3926 1.4192 6.1491 6.2878 5.1172 1.3922 1.3296 3.8940 2.9650 2.7194 2.3066 2.0266 3.0085 2.8071 1.7913 1.6778 1.7958 2.8584 1.7925 1.4158 1.0553 1.0553 1.5804 1.1212 1.2180 1.2657 1.3553 2.4822 2.3924 1.6134 1.1221 1.1378 1.2845 1.2896 1.3549 1.4357 1.3650 2.5852 2.4663 1.3103 5.8330 3.6637 1.7216 1.4114 1.4139 2.3829 2.3573 1.0808 2.1914 1.0961 1.0868 1.0907 1.0908 1.1009 2.6089 6.7124 6.2708 6.9247 6.1025 6.0527 8.0960 1.0549 1.0559 1.1061 1.1046 1.0616 1.0618 1.0617 1.0609 1.0997 1.0993 1.1051 1.1051 1.0846 1.0846 1.0885 1.0887 1.0933 1.0931 1.0961 1.0956 1.1002 1.1003 1.0665 1.0665
irintensity: 0.0180 0.1431 0.0978 1.1463 1.9969 0.2093 6.4912 19.6491 0.3457 0.1650 0.3210 0.6181 0.2391 0.3033 0.5816 0.2134 0.7704 0.4529 5.3060 0.8638 16.9147 137.8731 125.4901 12.1071 6.0104 1.8823 4.8929 0.5158 0.4432 1.6656 15.9849 56.3049 2.0988 13.1184 1.8829 0.5845 0.3203 5.5608 11.6693 8.8077 15.7615 6.5378 85.1973 19.3485 4.2028 72.0920 34.6630 5.0991 20.5415 1.3369 0.5450 33.3086 8.8021 4.8475 9.6681 18.4561 7.7673 41.4861 122.1346 3.6978 1.9639 7.7706 7.2218 22.8291 3.0367 1.8456 1.3640 7.6979 9.0334 4.8942 4.0154 29.4475 20.5631 18.2385 1.4314 13.3036 9.8988 2.1378 14.0032 0.1271 0.0773 27.8881 5.3621 8.0453 8.3549 56.9015 29.2518 48.9091 11.3795 2.4266 4.4204 18.4052 5.1631 34.2251 7.8177 0.2884 137.3465 9.1955 14.3883 1.8802 0.5502 17.6317 9.0802 10.6541 13.6300 8.2340 7.6849 17.2043 7.1305 10.7417 16.0321 0.9354 19.3642 38.1825 18.8301 24.8881 16.4822 55.2848 44.9291 920.2245 61.3011 79.5392 48.4221 48.8294 29.6686 62.6151 20.9679 34.3544 3.2455 2.0218 23.7626 60.5828 1.5326 2.8014 10.4771 8.3477 42.8599 26.1052 17.5463 18.0026 25.1481 10.3425 2.5882 2.2190
temp: 298.150 k
press: 1.00000 atm
elementType: 8 8 8 7 7 6 6 6 6 6 6 6 6 6 6 6 6 6 6 6 6 6 6 6 6 6 1 1 1 1 1 1 1 1 1 1 1 1 1 1 1 1 1 1 1 1 1 1 1 1
symmnumber: 1
zpe: 1069526.9 jmol-1
zpe.correction: 0.407361 hartree
zpe.thermalcorrener: 0.432944 hartree
zpe.thermalcorrenthalpy: 0.433888 hartree
zpe.thermalcorrgfe: 0.347411 hartree
zpe.sumelectzpe: -1147.870291 hartree
zpe.sumelectthermal: -1147.844708 hartree
zpe.sumelectthermalent: -1147.843764 hartree
zpe.sumelectthermalfe: -1147.930241 hartree
dipole: 3.0888 0.9019 0.2471
dipole: 3.2272
quadrupole: -123.1463 -127.5755 -168.7318
quadrupole: 0.4138 -0.7870 9.5302
quadrupole: 16.6716 12.2424 -28.9140 0.4138 -0.7870 9.5302
hfenergy: -1148.2776523 hartree
pointgroup: C01 [X(C21H24N2O3)]
dipole: -1.2181596 -0.3412308 0.10854 debye
polarizability: 332.0764322|-10.0279354|345.3362726|-0.1399514|-10.5986637|150.4318911 unknown
InChI: InChI=1S/C21H24N2O3/c24-15-7-13-23(14-8-16-25)21-22-19(17-9-3-1-4-10-17)20(26-21)18-11-5-2-6-12-18/h1-6,9-12,24-25H,7-8,13-16H2
charge 0 multiplicity 1
50 atoms
O  -0.47905 -1.065553 0.161215
O  -4.712188 3.982831 2.091866
O  -4.679211 -3.957128 -1.894097
N  -2.565007 0.067148 0.010813
N  -0.42654 1.203574 -0.212483
C  -3.332538 1.305916 -0.2340
C  -3.270462 -1.193665 0.311796
C  -3.630685 2.091077 1.064823
C  -3.615704 -2.010716 -0.956769
C  -1.20049 0.1329 -0.017601
C  0.910779 -0.663576 0.077179
C  0.910027 0.710839 -0.180741
C  -4.417764 3.374149 0.784102
C  -4.368275 -3.299824 -0.6147
C  1.874817 -1.726108 0.354236
C  2.016241 1.64793 -0.455925
C  3.158423 -1.4435 0.906396
C  1.525144 -3.087592 0.113456
C  3.242033 1.229333 -1.043505
C  1.830851 3.030242 -0.176359
C  4.066457 -2.485776 1.180636
C  2.435722 -4.125918 0.396835
C  4.263726 2.163717 -1.313114
C  2.855545 3.961823 -0.443692
C  3.714887 -3.833136 0.925513
C  4.080133 3.533545 -1.008254
H  -2.74754 1.936217 -0.927691
H  -4.276839 1.02549 -0.74066
H  -4.196358 -0.936608 0.862758
H  -2.641675 -1.79861 0.989833
H  -2.678532 2.351065 1.560408
H  -4.215647 1.466597 1.766947
H  -4.241398 -1.407231 -1.641251
H  -2.686785 -2.266758 -1.497014
H  -5.360252 3.137297 0.240656
H  -3.813317 4.060606 0.15189
H  -5.301645 -3.063581 -0.055878
H  -3.735468 -3.953629 0.025076
H  3.433107 -0.410164 1.139779
H  0.537621 -3.318635 -0.298511
H  3.386051 0.177638 -1.311672
H  0.872991 3.35255 0.243572
H  -5.171318 4.849821 1.956574
H  -5.137584 -4.817859 -1.721361
H  5.046714 -2.246823 1.608376
H  2.148663 -5.16529 0.200815
H  5.199427 1.824691 -1.772051
H  2.698808 5.022167 -0.215138
H  4.422963 -4.640455 1.142344
H  4.876044 4.257076 -1.217628
