program: Gaussian 09
title: 000087706
version: EM64L-G09RevD.01
frameworkgroup: C1[X(C13H17Cl2NO2)]
method: RPBEPBE
basis: SDD
operation: Freq
keyword: #p
keyword: freq=noraman
keyword: PBEPBE/SDD
title: #p freq=noraman PBEPBE/SDD
converged: YES YES NO NO
title: Mulliken charges:
elementType: Cl Cl O O N C C C C C C C C C C C C C H H H H H H H H H H H H H H H H H
charge: -0.057432 -0.061615 -0.294355 -0.251583 -0.217253 0.304596 -0.402649 -0.364196 0.331125 -0.455545 0.264526 -0.369263 -0.587740 -0.584224 -0.834817 -0.395614 0.153674 -0.499868 0.260284 0.253492 0.238630 0.264992 0.270628 0.235689 0.266196 0.277077 0.282778 0.267151 0.236759 0.234936 0.242977 0.272291 0.242551 0.232127 0.243673
chargesum: 0.00000
title: Mulliken charges with hydrogens summed into heavy atoms:
elementType: Cl Cl O O N C C C C C C C C C C C C C
charge: -0.057432 -0.061615 -0.294355 -0.251583 -0.217253 0.304596 0.111128 0.139426 0.331125 -0.184916 0.264526 -0.133574 -0.044467 -0.034295 -0.120146 -0.123323 0.153674 0.218483
polarizability: 2.24193975e+02 5.50929074e+00 2.03858394e+02 1.18210098e+01 1.05551768e+01 1.20910690e+02
1716.lowfreq: -9.6909 -4.7478 -0.3494 0.0010 0.0011 0.0013 15.1456 37.2635 38.8017
frequency: 14.6969 37.2337 38.7841 44.5343 55.0794 81.4149 89.8222 102.6119 105.1303 127.8772 145.6255 179.3687 199.7695 203.5924 224.9392 246.2072 259.2954 292.7474 302.7828 322.6077 338.7750 365.9999 385.3586 431.4099 464.1276 509.2397 563.7418 578.6719 630.1744 676.0361 682.1823 713.4453 727.2987 732.0664 751.0222 774.6938 781.0327 847.6770 851.2843 907.3766 925.3366 971.2159 977.6370 994.2367 996.0988 1023.0778 1035.0909 1042.1813 1048.7398 1074.4565 1112.6761 1114.5892 1122.5183 1147.9060 1168.5776 1197.9187 1223.0637 1238.8799 1248.8387 1256.4974 1272.0100 1286.5743 1302.7257 1341.3751 1356.7108 1363.2842 1378.9073 1392.9803 1411.4589 1425.2833 1452.0419 1453.6076 1455.7565 1464.2138 1466.2714 1468.7846 1478.7036 1489.7643 1497.4744 1572.1352 1608.7759 1627.3520 2967.1845 2988.0594 3003.6282 3020.8426 3049.6374 3051.9807 3058.4421 3075.2181 3078.7187 3086.8771 3105.0386 3128.4181 3138.4344 3144.0221 3147.2429 3168.4289 3177.6528
redmass: 6.1558 8.3458 12.3445 8.3434 4.1349 2.5368 2.1847 3.5071 1.4340 2.4993 3.4529 3.8457 6.0373 4.6387 4.1663 2.4533 1.3568 3.9550 4.7054 5.0617 2.8186 4.0727 5.1268 4.0786 3.4603 3.9613 4.5965 4.8387 6.4078 6.2707 6.1294 4.2421 5.0051 2.8722 4.3029 1.2048 1.2008 1.3913 5.1657 1.5914 6.0215 2.2288 1.3538 1.6849 1.5485 3.0847 4.5293 1.5565 1.7429 3.3906 1.5931 1.2640 1.7568 1.4603 1.4164 1.9057 2.5718 2.0830 1.3204 1.1841 1.5582 1.4198 1.2592 1.3657 1.2993 1.9230 3.7616 1.2967 2.5533 1.2565 1.0501 1.0865 1.0897 1.0520 1.1008 1.1075 1.0913 1.0828 2.9739 6.7813 6.9275 9.3919 1.0403 1.0659 1.0295 1.0598 1.0927 1.0572 1.0566 1.0989 1.1014 1.0994 1.1045 1.0895 1.1121 1.1118 1.1047 1.0950 1.0910
irintensity: 0.2075 0.9507 1.0932 1.4169 1.5762 0.8524 0.9999 0.7819 0.0137 1.3779 4.1445 0.1515 3.4557 5.8270 7.1690 1.2381 2.7503 14.8760 7.4493 0.7137 1.2065 13.1836 3.4732 4.4828 9.3951 5.3805 6.6170 13.3829 6.5992 66.0843 43.3136 14.9938 32.7928 17.3624 4.4542 3.1939 9.0153 18.4455 3.0695 16.3381 1.1119 27.9013 1.7236 27.7589 17.7330 2.8541 0.7140 12.7078 17.0494 132.5222 25.7608 0.1596 100.9598 43.0342 33.9979 33.9096 7.5663 148.3095 78.3640 12.6779 43.7974 31.0096 17.0704 12.0798 10.5048 1.6439 4.1440 17.2932 35.5122 51.0718 13.1215 9.8185 3.4730 10.6339 13.5442 20.0620 23.2764 16.9888 93.4687 107.3603 82.1690 146.1979 27.9504 27.5538 40.8553 26.1772 16.3480 20.4951 19.0870 11.0634 12.5399 10.8135 25.5835 17.5924 15.6584 18.2926 14.2979 4.5229 2.6973
temp: 298.150 k
press: 1.00000 atm
elementType: 17 17 8 8 7 6 6 6 6 6 6 6 6 6 6 6 6 6 1 1 1 1 1 1 1 1 1 1 1 1 1 1 1 1 1
symmnumber: 1
zpe: 727696.1 jmol-1
zpe.correction: 0.277165 hartree
zpe.thermalcorrener: 0.297033 hartree
zpe.thermalcorrenthalpy: 0.297977 hartree
zpe.thermalcorrgfe: 0.225415 hartree
zpe.sumelectzpe: -1629.532109 hartree
zpe.sumelectthermal: -1629.512241 hartree
zpe.sumelectthermalent: -1629.511296 hartree
zpe.sumelectthermalfe: -1629.583859 hartree
dipole: -0.6335 -0.2133 -0.8180
dipole: 1.0564
quadrupole: -134.6986 -123.9270 -121.9572
quadrupole: 9.4651 8.0746 10.0811
quadrupole: -7.8376 2.9339 4.9037 9.4651 8.0746 10.0811
hfenergy: -1629.8092738 hartree
pointgroup: C01 [X(C13H17Cl2N1O2)]
dipole: -0.2780135 -0.2445256 -0.1888137 debye
polarizability: 222.7064337|6.3109113|195.0540403|-9.4604524|-30.7129508|131.2025852 unknown
InChI: InChI=1S/C13H17Cl2NO2/c1-10-3-4-11(13(17)18-2)9-12(10)16(7-5-14)8-6-15/h3-4,9H,5-8H2,1-2H3
charge 0 multiplicity 1
35 atoms
Cl -2.307202 3.428324 -2.381969
Cl -4.038612 -0.092981 3.073332
O  2.812421 1.771546 -0.454425
O  4.333433 0.082107 0.057575
N  -1.800946 -0.239059 -0.437144
C  -0.497229 -0.780292 -0.188354
C  -1.983956 0.796737 -1.474106
C  -2.902715 -0.431463 0.527649
C  -0.305649 -2.178435 0.083984
C  0.64176 0.064731 -0.269215
C  1.947255 -0.431132 -0.051915
C  1.012115 -2.642657 0.334593
C  -2.046557 2.240974 -0.931125
C  -2.608307 0.248023 1.880081
C  -1.437553 -3.186396 0.03022
C  2.133807 -1.796569 0.275981
C  3.147314 0.448347 -0.133169
C  3.955866 2.706463 -0.560442
H  -1.158063 0.716513 -2.200949
H  -2.924004 0.594906 -2.024584
H  -3.824562 -0.006704 0.091328
H  -3.103183 -1.499344 0.713895
H  0.528386 1.128519 -0.491113
H  1.154879 -3.709339 0.544554
H  -2.908697 2.409748 -0.268192
H  -1.114538 2.56407 -0.444763
H  -1.711889 -0.167046 2.364191
H  -2.53479 1.343229 1.8085
H  -1.040307 -4.195011 -0.17524
H  -1.998809 -3.249996 0.983658
H  -2.158567 -2.92937 -0.766304
H  3.146431 -2.169577 0.456367
H  4.493141 2.764342 0.40123
H  3.505084 3.67398 -0.822468
H  4.655245 2.368112 -1.343361
