program: Gaussian 09
title: 000008226
version: EM64L-G09RevD.01
frameworkgroup: C1[X(C20H25N3O2)]
method: RPBEPBE
basis: SDD
operation: Freq
keyword: #p
keyword: freq=noraman
keyword: PBEPBE/SDD
title: #p freq=noraman PBEPBE/SDD
converged: YES YES NO NO
title: Mulliken charges:
elementType: O O N N N C C C C C C C C C C C C C C C C C C C C H H H H H H H H H H H H H H H H H H H H H H H H H
charge: -0.256979 -0.436586 -0.114107 -0.405311 -0.425779 -0.171216 0.377023 -0.591251 -0.259374 -0.472321 0.365995 0.230316 -0.183715 -0.430494 0.237254 -0.642114 0.213353 -0.438815 -0.431570 -0.366544 -0.203940 -0.018307 -0.402180 -0.376182 -0.703393 0.211146 0.216449 0.245195 0.240076 0.221444 0.234736 0.219998 0.224324 0.233669 0.191249 0.265375 0.224115 0.303261 0.228706 0.310658 0.217352 0.231529 0.205953 0.217581 0.244339 0.219833 0.212008 0.231353 0.221037 0.334852
chargesum: 0.00000
title: Mulliken charges with hydrogens summed into heavy atoms:
elementType: O O N N N C C C C C C C C C C C C C C C C C C C C
charge: -0.256979 -0.101734 -0.114107 -0.102051 -0.115121 0.039930 0.377023 -0.129608 -0.019298 -0.016142 0.365995 0.230316 -0.183715 -0.210495 0.237254 0.007127 0.213353 -0.173440 -0.207454 -0.137838 0.013411 0.213223 0.021354 0.087989 -0.038994
polarizability: 3.42060725e+02 -8.38908500e+00 2.59255163e+02 -4.51370303e+00 -7.52463844e+00 1.51755903e+02
1716.lowfreq: -17.8937 -6.3245 -0.0008 0.0003 0.0006 5.3223 6.1632 20.7862 28.5704
frequency: -15.3818 20.4849 28.5340 53.8083 55.7034 64.5626 79.5971 87.2678 127.1025 145.1103 165.0085 185.4069 194.2862 205.7061 218.2421 233.5986 242.8508 251.4916 268.5337 277.9865 298.5995 317.1790 322.0022 326.4546 367.3529 386.5925 403.6358 442.2423 449.9026 466.4703 483.7052 495.8297 517.7414 545.7290 553.1489 565.0396 594.8716 599.3891 616.3341 629.1664 651.6385 682.9434 722.9204 737.3723 746.6601 757.7988 776.5373 788.4494 794.0406 813.4845 834.4565 839.0113 848.2090 878.6370 880.9500 904.8207 942.3243 953.4250 954.4142 964.8641 981.8703 993.4286 994.5309 1035.0042 1041.8994 1044.4757 1059.8927 1063.2457 1068.6236 1099.4338 1108.0636 1108.5811 1115.3705 1131.4431 1139.8220 1155.2501 1169.2361 1184.5742 1189.2428 1190.1234 1214.1818 1223.4482 1241.2381 1242.2464 1255.1157 1260.3516 1280.4572 1289.5237 1294.1041 1295.3779 1305.3089 1311.2627 1316.0960 1340.9228 1348.0548 1355.1203 1357.2405 1372.2545 1373.3044 1395.1143 1404.7349 1421.2979 1436.7135 1451.4090 1458.0436 1461.8504 1464.7579 1471.3875 1471.7464 1476.0079 1481.9050 1484.0246 1492.0352 1496.2549 1568.1541 1608.7299 1614.7179 1623.0712 1658.9669 2801.0661 2861.9346 2913.0100 2942.3645 2974.7243 2981.2991 2982.6431 2992.9942 3010.0709 3031.5396 3034.9787 3044.4320 3050.4670 3077.4357 3084.6191 3089.6451 3092.8331 3096.9932 3123.9499 3138.8833 3157.4881 3219.6040 3530.4769 3550.5980 3614.3429
redmass: 4.4937 4.7307 5.1572 2.7423 5.7792 3.5069 4.2483 5.1259 2.2869 2.3922 2.7988 2.9237 1.8240 3.4261 2.7168 3.0588 3.2696 1.6535 1.9775 2.3631 3.0386 2.1008 4.0411 2.6401 2.9236 3.4698 4.9137 4.3549 2.8751 4.1839 3.5589 1.3503 2.7075 3.6616 1.2003 3.9904 3.9822 3.5553 3.5822 2.8714 3.0921 4.6481 4.2198 4.6152 2.1562 2.3468 1.9527 2.1156 1.8113 3.4597 4.6211 1.7605 1.9051 2.5274 1.4343 2.7798 2.9866 2.4709 1.4250 2.3268 2.1190 2.0764 2.0316 2.2958 2.4211 2.4638 2.8962 2.0085 1.9488 3.1601 1.3795 1.9951 1.6273 2.4830 1.6248 2.3099 1.3051 1.2698 1.4182 1.5869 1.5288 2.2129 1.5038 2.0927 1.5104 1.6069 1.6694 1.5635 1.4665 1.3517 1.5600 1.2878 1.3874 3.0061 1.3022 1.5248 1.6489 1.4467 1.3001 1.2110 2.8190 3.3219 1.1836 2.2927 1.5421 1.4035 1.2657 1.0710 1.1454 1.0696 1.0597 1.0514 1.0533 3.3128 6.9446 6.9500 7.9879 7.4666 8.6774 1.0786 1.0570 1.0693 1.0803 1.0590 1.0626 1.0367 1.0801 1.0691 1.1007 1.0742 1.0925 1.0966 1.0996 1.1004 1.0995 1.0899 1.0997 1.0856 1.0915 1.0984 1.0982 1.0776 1.0658 1.0808
irintensity: 1.1662 0.6890 0.1404 0.3676 7.7687 0.7036 1.4712 1.3252 4.8180 3.0471 5.8528 1.1166 0.9522 7.7599 1.0926 1.5782 5.2131 2.7473 16.5804 28.4849 0.7774 69.5420 0.7181 44.1163 6.6202 3.4960 2.2412 2.3320 5.9414 0.2608 2.0903 91.9215 18.0021 4.8562 42.9697 3.2667 1.1888 1.2861 1.4102 3.0421 5.8907 18.8057 2.6042 2.4175 19.0962 53.9528 37.9640 24.9053 0.3577 7.0199 8.6137 4.1720 25.7232 4.7322 1.9777 17.3905 4.3315 14.4562 1.5031 22.5903 3.7072 19.5400 28.1908 1.7238 18.2399 24.1617 25.7392 5.8149 43.2413 0.2663 2.7917 15.5094 1.0874 19.2757 7.1172 8.0279 3.5763 12.4044 43.0460 35.2785 6.3872 3.4050 21.5062 4.4090 19.8509 5.5199 6.7603 1.0431 26.5368 4.7045 41.8438 7.0746 17.2207 21.4530 8.8795 5.7215 4.5750 5.0766 12.7600 5.9386 7.4679 13.3877 3.7944 37.9613 287.5864 10.4622 87.8095 11.9203 3.8041 12.5706 24.3589 23.4522 10.9811 0.1594 4.0278 147.3763 8.8280 5.4508 0.8730 53.0540 124.0878 46.8727 36.9426 32.2282 29.5864 32.3961 9.9804 32.2201 15.5055 33.8558 40.4532 39.3858 44.0853 46.4567 31.7072 24.5746 34.9093 3.0271 16.8556 32.1649 1.5513 18.8807 1.7015 68.6106
temp: 298.150 k
press: 1.00000 atm
elementType: 8 8 7 7 7 6 6 6 6 6 6 6 6 6 6 6 6 6 6 6 6 6 6 6 6 1 1 1 1 1 1 1 1 1 1 1 1 1 1 1 1 1 1 1 1 1 1 1 1 1
symmnumber: 1
zpe: 1092481.6 jmol-1
zpe.correction: 0.416104 hartree
zpe.thermalcorrener: 0.438870 hartree
zpe.thermalcorrenthalpy: 0.439814 hartree
zpe.thermalcorrgfe: 0.363692 hartree
zpe.sumelectzpe: -1089.976204 hartree
zpe.sumelectthermal: -1089.953438 hartree
zpe.sumelectthermalent: -1089.952494 hartree
zpe.sumelectthermalfe: -1090.028616 hartree
dipole: 2.9642 0.8308 -2.6186
dipole: 4.0415
quadrupole: -113.9513 -146.6816 -155.8888
quadrupole: -7.2239 7.8378 -2.2919
quadrupole: 24.8892 -7.8410 -17.0482 -7.2239 7.8378 -2.2919
hfenergy: -1090.392308 hartree
pointgroup: C01 [X(C20H25N3O2)]
dipole: 1.0400358 -0.8074357 0.8914122 debye
polarizability: 339.7048281|-4.336782|246.6712115|24.007911|34.0548752|166.6957521 unknown
InChI: InChI=1S/C20H25N3O2/c1-3-14(11-24)22-20(25)13-7-16-15-5-4-6-17-19(15)12(9-21-17)8-18(16)23(2)10-13/h4-7,9,13-14,18,21-22,24H,3,8,10-11H2,1-2H3
charge 0 multiplicity 1
50 atoms
O  -2.925033 -0.395972 -2.197758
O  -4.072305 2.701692 0.453216
N  0.53747 -2.649008 -0.98704
N  5.313734 0.432636 1.164705
N  -3.633738 -0.214665 0.00593
C  1.518851 -1.559172 -0.725787
C  0.852602 -0.360611 -0.011725
C  2.748147 -2.126235 0.073498
C  -1.463918 -1.313629 -0.409091
C  -0.75783 -2.135287 -1.501185
C  3.670309 -1.006561 0.48552
C  1.775495 0.700422 0.464237
C  3.119909 0.307176 0.656669
C  -0.498069 -0.285983 0.15608
C  4.143305 1.200956 1.088029
C  1.07585 -3.705335 -1.871558
C  -2.725673 -0.61499 -0.963777
C  5.024569 -0.904372 0.796511
C  1.476046 2.059858 0.719235
C  3.839727 2.556565 1.352028
C  2.494562 2.956877 1.159205
C  -4.908149 0.471647 -0.325243
C  -5.892939 0.301574 0.854603
C  -4.631027 1.952901 -0.683461
C  -7.315196 0.814452 0.545607
H  1.925326 -1.159132 -1.695708
H  3.280518 -2.871555 -0.543264
H  2.344577 -2.659812 0.957168
H  -1.777936 -2.003693 0.404558
H  -1.384709 -2.999222 -1.784967
H  -0.64271 -1.498883 -2.409595
H  -0.924695 0.559315 0.714448
H  0.290609 -4.46048 -2.05024
H  1.926683 -4.220588 -1.396487
H  1.413642 -3.316457 -2.865466
H  5.809858 -1.658403 0.794743
H  0.465853 2.449166 0.549439
H  6.231939 0.774131 1.438507
H  4.594495 3.277365 1.68436
H  -3.470954 -0.48491 0.978797
H  2.227995 4.004218 1.342062
H  -5.32135 -0.011513 -1.233805
H  -5.94108 -0.774089 1.118139
H  -5.492736 0.846439 1.733212
H  -3.957845 1.993846 -1.561243
H  -5.571848 2.469745 -0.930654
H  -7.726357 0.337032 -0.363721
H  -7.327283 1.908096 0.394791
H  -7.999191 0.589301 1.3832
H  -3.169201 2.337446 0.638575
