program: Gaussian 09
title: 000087634
version: EM64L-G09RevD.01
frameworkgroup: C1[X(C14H13ClSi)]
method: RPBEPBE
basis: SDD
operation: Freq
keyword: #p
keyword: freq=noraman
keyword: PBEPBE/SDD
title: #p freq=noraman PBEPBE/SDD
converged: YES YES NO NO
title: Mulliken charges:
elementType: Cl Si C C C C C C C C C C C C C C H H H H H H H H H H H H H
charge: -0.292486 1.057823 -0.170138 -0.184132 -0.441203 -0.295438 -0.277550 -0.295532 -0.302529 -0.235061 -0.229583 -0.226379 -0.230215 -0.227517 -0.230389 -0.502090 0.233338 0.251042 0.255330 0.251460 0.240240 0.231551 0.231833 0.230693 0.230528 0.231660 0.231450 0.223893 0.239399
chargesum: 0.00000
title: Mulliken charges with hydrogens summed into heavy atoms:
elementType: Cl Si C C C C C C C C C C C C C C
charge: -0.292486 1.057823 -0.170138 -0.184132 -0.207864 -0.044396 -0.022220 -0.044073 -0.062289 -0.003510 0.002250 0.004314 0.000313 0.004143 0.001061 -0.038797
polarizability: 2.15508415e+02 1.34398944e+01 1.60880459e+02 4.74196343e+00 1.59938485e+00 1.50611474e+02
1716.lowfreq: -13.6783 -7.4760 -0.0019 0.0012 0.0020 3.4071 6.0740 23.3667 44.7659
frequency: -6.3035 22.7468 44.7437 63.1901 68.0628 97.4867 105.4731 148.8873 187.7541 196.3872 234.1005 265.1170 292.8052 351.5829 390.9468 392.8076 433.0786 451.2917 479.0872 516.1145 578.6315 613.7541 614.8877 653.1980 702.4858 704.5913 705.7429 715.1577 751.6975 753.2338 859.9949 863.4274 928.8677 929.7499 980.4379 982.5717 986.3858 986.8346 991.1569 1001.0324 1001.9181 1012.6600 1019.3554 1023.0042 1024.4416 1076.7155 1077.2556 1100.0415 1107.0740 1174.9058 1174.9531 1197.6018 1199.0106 1265.2087 1312.2400 1313.3254 1367.8516 1368.0072 1411.8669 1419.6461 1420.1691 1469.7845 1471.1841 1577.6906 1578.2392 1597.2848 1597.8415 1605.4064 3073.3608 3098.5038 3115.1463 3120.0812 3123.1700 3124.2149 3134.2776 3134.5626 3146.8204 3146.8926 3162.3656 3162.7257 3178.4861
redmass: 3.8639 3.7439 5.5548 3.6144 5.0124 5.7395 5.4671 2.7021 4.1365 4.9418 5.3854 5.1736 5.5809 4.5643 2.7687 2.7869 4.9841 4.2471 3.6335 5.4493 2.0456 6.4119 6.3258 5.6278 3.2408 1.8980 2.8608 3.5885 1.7346 1.8347 1.2468 1.2454 1.3513 1.3509 1.4043 1.4049 5.3448 6.0020 1.3876 1.3200 1.3201 1.2887 1.1012 2.9043 2.6449 1.7058 1.7060 2.7207 2.9286 1.0562 1.0567 1.1279 1.1279 1.3000 1.4065 1.4064 5.3343 5.3259 1.2668 2.1275 2.0832 2.0192 2.0236 5.5282 5.5717 5.7850 5.7810 3.8100 1.0590 1.0918 1.0872 1.0853 1.0878 1.0864 1.0916 1.0917 1.0962 1.0961 1.1016 1.1016 1.1148
irintensity: 0.0676 0.0663 0.1774 0.2539 0.8195 2.1111 1.5415 1.3689 1.8990 3.3936 1.1125 1.2385 4.2479 6.6237 0.0373 0.2103 14.8258 24.1372 22.6249 103.2565 97.9823 0.3166 3.1412 24.1884 22.0359 40.6994 50.8402 113.8868 32.1440 12.7855 0.1944 0.0387 0.1592 0.1550 1.4480 1.4391 2.7450 0.7962 41.5869 0.0503 0.3915 8.0117 24.2138 1.6028 1.0027 2.1911 1.4319 22.4308 68.6832 0.1382 0.3451 8.4520 1.6899 5.1075 6.6678 4.8357 0.9005 1.0946 18.0170 19.3405 24.5649 2.2618 7.4296 0.8076 0.1074 1.6129 0.5660 3.9040 11.6621 8.2402 3.5680 1.3611 0.6343 0.1913 7.8972 4.7088 38.6881 28.6978 46.4922 17.7408 21.3799
temp: 298.150 k
press: 1.00000 atm
elementType: 17 14 6 6 6 6 6 6 6 6 6 6 6 6 6 6 1 1 1 1 1 1 1 1 1 1 1 1 1
symmnumber: 1
zpe: 584560.0 jmol-1
zpe.correction: 0.222647 hartree
zpe.thermalcorrener: 0.237608 hartree
zpe.thermalcorrenthalpy: 0.238552 hartree
zpe.thermalcorrgfe: 0.178548 hartree
zpe.sumelectzpe: -1289.646144 hartree
zpe.sumelectthermal: -1289.631183 hartree
zpe.sumelectthermalent: -1289.630239 hartree
zpe.sumelectthermalfe: -1289.690243 hartree
dipole: 0.0439 -2.2591 2.7149
dipole: 3.5321
quadrupole: -93.4387 -106.4398 -107.9449
quadrupole: 2.6360 0.8070 7.3153
quadrupole: 9.1691 -3.8320 -5.3371 2.6360 0.8070 7.3153
hfenergy: -1289.8687908 hartree
pointgroup: C01 [X(C14H13Cl1Si1)]
dipole: -0.1320535 -0.0026373 -1.3833627 debye
polarizability: 213.8084246|-13.910425|158.7528345|-9.8634474|6.0022099|154.4390895 unknown
InChI: InChI=1S/C14H13ClSi/c1-2-16(15,13-9-5-3-6-10-13)14-11-7-4-8-12-14/h2-12H,1H2
charge 0 multiplicity 1
29 atoms
Cl 0.145305 0.50992 3.061167
Si 0.040142 0.777471 0.8447
C  -1.497843 -0.160239 0.244664
C  1.651773 0.066128 0.133333
C  -0.096386 2.637226 0.565525
C  -2.783256 0.134996 0.778245
C  2.296966 -1.051529 0.72796
C  -1.388326 -1.169611 -0.750519
C  2.214831 0.63296 -1.043435
C  -3.928581 -0.557034 0.326376
C  3.47259 -1.591569 0.159708
C  -2.534642 -1.861744 -1.205125
C  3.390394 0.092678 -1.613935
C  -3.806079 -1.556353 -0.668067
C  4.020208 -1.021918 -1.01374
C  -1.084626 3.237814 -0.151384
H  0.686022 3.264009 1.020131
H  -2.888038 0.895733 1.56132
H  1.889661 -1.488357 1.647314
H  -0.406166 -1.420293 -1.169306
H  1.739106 1.50245 -1.51496
H  -4.910985 -0.322366 0.751328
H  3.961391 -2.450592 0.632892
H  -2.433799 -2.638574 -1.971465
H  3.813458 0.542169 -2.51941
H  -4.694094 -2.095788 -1.017008
H  4.933485 -1.439262 -1.453078
H  -1.1167 4.326818 -0.289641
H  -1.89361 2.663957 -0.62159
