program: Gaussian 09
title: 000087595
version: EM64L-G09RevD.01
frameworkgroup: C1[X(C4H5O2)]
method: RPBEPBE
basis: SDD
operation: Freq
keyword: #p
keyword: freq=noraman
keyword: PBEPBE/SDD
title: #p freq=noraman PBEPBE/SDD
converged: YES YES NO YES
title: Mulliken charges:
elementType: O O C C C C H H H H H
charge: -0.421890 -0.425822 0.330160 -0.797886 0.019012 -0.739302 0.227254 0.165295 0.227042 0.173951 0.242186
chargesum: -1.00000
title: Mulliken charges with hydrogens summed into heavy atoms:
elementType: O O C C C C
charge: -0.421890 -0.425822 0.330160 -0.178295 0.019012 -0.323164
polarizability: 5.67963240e+01 -4.42450840e+00 6.90333588e+01 4.65485338e-03 -8.14626868e-03 2.83900635e+01
1716.lowfreq: -4.9829 -0.0004 0.0007 0.0009 14.1421 19.0176 55.5639 129.2835 264.9888
frequency: 55.5080 129.2517 264.9863 357.1955 363.6423 498.2850 552.7319 647.6476 764.6567 789.5347 919.0214 921.2573 984.0891 1039.1205 1188.1050 1263.5655 1357.8605 1383.5783 1433.0149 1458.4396 1526.4158 1643.8759 2955.9530 3044.6428 3054.8431 3058.3482 3170.6726
redmass: 3.7183 1.1266 3.9488 2.6538 3.4636 5.6001 4.1771 1.4744 8.5745 2.1140 1.9321 1.3556 1.4028 1.4967 4.8174 4.5396 1.1751 1.2592 1.0506 1.0617 11.8886 5.5260 1.0362 1.0627 1.0970 1.0961 1.1104
irintensity: 0.4598 0.5238 1.8459 6.0740 0.0318 2.7863 5.4457 5.9957 38.8834 14.2702 7.1485 84.1903 5.7280 6.8338 116.9915 55.8696 20.2931 21.9617 6.9428 19.3924 297.7003 8.5562 68.4549 44.2526 65.2314 34.2000 19.2662
temp: 298.150 k
press: 1.00000 atm
elementType: 8 8 6 6 6 6 1 1 1 1 1
symmnumber: 1
zpe: 208307.2 jmol-1
zpe.correction: 0.079340 hartree
zpe.thermalcorrener: 0.085799 hartree
zpe.thermalcorrenthalpy: 0.086743 hartree
zpe.thermalcorrgfe: 0.048813 hartree
zpe.sumelectzpe: -305.450901 hartree
zpe.sumelectthermal: -305.444442 hartree
zpe.sumelectthermalent: -305.443498 hartree
zpe.sumelectthermalfe: -305.481428 hartree
dipole: -6.1027 0.2367 0.0017
dipole: 6.1073
quadrupole: -51.4162 -46.7987 -38.4738
quadrupole: 0.9324 -0.0040 -0.0062
quadrupole: -5.8533 -1.2358 7.0891 0.9324 -0.0040 -0.0062
hfenergy: -305.5302407 hartree
pointgroup: C01 [X(C4H5O2)]
dipole: -2.4003321 -0.1000717 0.0420272 debye
dipolederiv: -0.9752188 -0.3170167 0.0576013 -0.2537828 -1.0239524 0.0927584 0.0472458 0.0937076 -0.4954469 -0.8310705 0.2888481 -0.0443888 0.0357571 -1.1718783 0.1147045 -0.0024726 0.1119731 -0.4972381 -0.1205759 0.1428296 -0.0219286 0.08896 0.324237 -0.0449009 -0.0129658 -0.0453154 0.0704975 0.0442278 -0.0857607 0.0143188 -0.1470381 -0.1793695 0.040879 0.0246814 0.0401248 0.0491178 1.2498297 -0.0980577 0.0043335 0.1451879 1.3134212 -0.210162 -0.0360817 -0.2079912 0.089071 -0.067477 0.1080803 -0.0230173 0.0570615 -0.2874575 -0.0448644 -0.0149524 -0.0452024 -0.5457855 0.0970723 0.018756 0.0497691 0.0181648 -0.0593393 -0.1152487 0.0167042 -0.1398179 -0.0241824 -0.3103415 -0.0485427 0.0122372 0.0646759 0.0552265 0.0042028 -0.006486 0.0054401 0.0841373 0.0953278 0.0036643 -0.0568815 0.0135426 0.022542 0.0990637 -0.0255107 0.1237827 -0.105538 -0.2684936 0.0880679 -0.0101335 0.0346122 0.058076 0.0193231 -0.0011111 0.0187845 0.172949 0.0867197 -0.1008682 0.0180898 -0.0571411 -0.0515055 0.0442446 0.0109489 0.0445141 0.2024183 unknown
polarizability: 57.605828|-5.3464058|67.1592494|0.596576|-6.4156777|29.4546688 unknown
InChI: InChI=1S/C4H5O2/c1-3(2)4(5)6/h1H2,2H3
charge -1 multiplicity 1
11 atoms
O  1.504713 1.04907 -0.184868
O  1.251281 -1.251853 0.199475
C  -0.739383 0.102269 -0.00474
C  -1.533837 -1.173098 0.216364
C  0.813206 -0.035831 0.002486
C  -1.328108 1.31468 -0.201736
H  -1.264875 -1.920691 -0.552545
H  -2.627497 -0.992357 0.198259
H  -1.247668 -1.630369 1.181716
H  -2.420303 1.45133 -0.213277
H  -0.681427 2.187251 -0.353936
