program: Gaussian 09
title: 000087633
version: EM64L-G09RevD.01
frameworkgroup: C1[X(C14H25NO3Si)]
method: RPBEPBE
basis: SDD
operation: Freq
keyword: #p
keyword: freq=noraman
keyword: PBEPBE/SDD
title: #p freq=noraman PBEPBE/SDD
converged: YES YES NO NO
title: Mulliken charges:
elementType: Si O O O N C C C C C C C C C C C C C C H H H H H H H H H H H H H H H H H H H H H H H H H
charge: 1.540465 -0.572388 -0.572465 -0.614962 -0.154400 -0.372214 -0.270155 -0.288239 0.396743 -0.362476 -0.343487 -0.212825 -0.212092 -0.190104 -0.645833 -0.645861 -0.659400 -0.661490 -0.666461 0.239092 0.265969 0.236972 0.236251 0.205748 0.198497 0.198203 0.205063 0.202383 0.206087 0.235328 0.234798 0.216230 0.235124 0.234361 0.216681 0.194317 0.227817 0.225555 0.194425 0.225796 0.227550 0.223585 0.222402 0.199413
chargesum: 0.00000
title: Mulliken charges with hydrogens summed into heavy atoms:
elementType: Si O O O N C C C C C C C C C C C C C C
charge: 1.540465 -0.572388 -0.572465 -0.614962 -0.154400 -0.372214 -0.031063 -0.022270 0.396743 -0.125504 -0.107236 0.191419 0.191174 0.218366 0.040523 0.040305 -0.011711 -0.013720 -0.021061
polarizability: 2.62495063e+02 1.34203054e-01 1.57011076e+02 -4.93240682e-01 -3.33993121e+00 1.82608677e+02
1716.lowfreq: -10.9961 -4.3416 -0.0016 -0.0010 0.0007 4.3190 13.3725 16.1024 20.2745
frequency: 12.2251 14.8629 20.2470 27.8736 40.8232 44.0381 44.6816 53.0717 68.3363 71.3369 76.0773 89.8351 115.5396 122.9430 174.0784 201.1390 208.1434 211.7171 215.4046 244.0485 250.5205 258.8010 268.4605 273.5739 281.0805 297.8872 330.3518 386.7134 411.0144 412.2558 448.9837 472.9523 484.9673 529.8952 578.7276 629.6675 661.8176 703.0054 718.8371 733.2821 759.6751 800.6115 805.8283 807.9220 810.9010 819.5469 929.5860 939.6552 940.6675 941.8868 945.2322 969.6420 997.0434 1052.9809 1056.0568 1060.2414 1075.5820 1101.2466 1102.4755 1103.5423 1108.5909 1109.9895 1120.3267 1130.7294 1137.1153 1138.4615 1140.4726 1168.0517 1214.7574 1258.4173 1262.1727 1266.1239 1267.5945 1312.5900 1360.7443 1361.4894 1364.7739 1365.8909 1370.1850 1389.5712 1389.8293 1390.6159 1421.1548 1436.5522 1455.6105 1455.7847 1457.0273 1458.7000 1463.9331 1475.3773 1476.4651 1476.6959 1478.0907 1490.3686 1491.7408 1493.5342 1495.3764 1503.6884 1521.2296 1545.5296 1621.6028 2938.9685 2943.2868 2945.8147 2947.0356 2957.1799 2987.1623 2988.2356 2988.5332 2995.7215 2998.1625 3004.4841 3007.2886 3010.1567 3084.2895 3085.2485 3085.4578 3095.9023 3098.2404 3101.4103 3101.5315 3105.6733 3113.9476 3136.4199 3160.1228 3164.8268
redmass: 2.7434 3.1619 3.5045 2.8920 2.8995 2.8360 2.3782 2.0635 2.5437 2.8373 2.3813 3.9542 1.6906 4.6705 2.4970 1.2941 2.3089 4.2236 1.9633 1.4208 1.3540 1.5938 3.8645 2.6621 2.9169 3.6791 3.9272 3.6651 3.8990 2.9563 5.2666 3.6152 4.5092 2.5738 4.3412 7.0759 5.6613 4.5258 5.5237 3.4220 5.9443 1.0884 1.1224 1.1126 1.3014 1.6491 2.5736 2.9493 2.7756 3.0564 1.3256 1.3349 3.5387 4.1390 1.5021 4.5768 4.8173 2.1611 2.1137 2.1511 1.2392 1.3219 3.3520 1.5784 1.4738 1.4726 1.4932 1.6268 1.1437 1.1271 2.9101 1.1254 1.1208 1.4184 1.3173 2.8388 3.0227 1.2862 1.2828 1.2631 1.2627 1.2657 2.0612 1.5060 1.0416 1.0427 1.2078 1.0418 1.0411 1.0467 1.0485 1.0481 1.0454 1.0793 1.0796 1.0842 1.0825 1.2663 1.9439 6.2501 5.8788 1.0368 1.0555 1.0555 1.0396 1.0559 1.0361 1.0362 1.0362 1.1072 1.1073 1.0992 1.1029 1.1071 1.0984 1.0983 1.0982 1.0960 1.1014 1.1013 1.1013 1.0940 1.0895 1.0883 1.0930 1.0947
irintensity: 0.0757 0.0185 0.3062 0.5789 0.1149 0.4810 0.5515 4.1557 1.0480 1.0568 0.1361 9.1856 0.4163 9.0808 0.6646 1.3971 7.4049 2.3997 4.8499 1.2660 1.5459 0.6442 8.9501 11.8431 13.2730 4.9264 9.5700 18.6919 10.6282 0.0312 12.4618 3.1269 62.2730 31.7643 2.5710 1.1299 111.7112 62.9251 88.1480 10.5846 29.4437 1.6321 5.2022 4.4394 11.1848 43.8844 70.8413 205.2590 71.3461 28.2711 0.3365 0.6329 3.4737 475.0062 16.4664 310.1991 91.3818 4.6683 6.1991 3.4053 0.0925 1.1613 169.2090 2.2084 2.4575 5.6386 10.2913 0.4176 23.7321 0.5250 30.3390 1.1695 4.6207 12.2458 12.6575 128.5069 2.8092 19.5330 1.2407 19.4707 33.5342 41.1537 2.8902 1.4382 2.1605 13.8949 15.9560 10.4700 0.0547 21.5351 6.4627 4.8095 4.1600 9.2062 3.5865 2.0157 0.5747 6.9333 196.9708 11.8062 330.9484 105.3233 49.3982 45.8180 102.3049 58.6651 35.4311 42.2751 19.9149 33.6571 49.6922 3.0037 84.3119 36.3634 44.4351 51.4416 22.6615 4.0642 42.7266 8.7242 72.3262 47.6303 7.5500 1.7857 23.8769 15.7512
temp: 298.150 k
press: 1.00000 atm
elementType: 14 8 8 8 7 6 6 6 6 6 6 6 6 6 6 6 6 6 6 1 1 1 1 1 1 1 1 1 1 1 1 1 1 1 1 1 1 1 1 1 1 1 1 1
symmnumber: 1
zpe: 969582.9 jmol-1
zpe.correction: 0.369295 hartree
zpe.thermalcorrener: 0.394065 hartree
zpe.thermalcorrenthalpy: 0.395009 hartree
zpe.thermalcorrgfe: 0.308735 hartree
zpe.sumelectzpe: -1116.860078 hartree
zpe.sumelectthermal: -1116.835308 hartree
zpe.sumelectthermalent: -1116.834364 hartree
zpe.sumelectthermalfe: -1116.920638 hartree
dipole: 4.7381 -0.1291 1.4648
dipole: 4.9610
quadrupole: -97.3876 -117.6687 -120.7784
quadrupole: 0.2911 -6.6149 -0.0901
quadrupole: 14.5573 -5.7238 -8.8335 0.2911 -6.6149 -0.0901
hfenergy: -1117.2293729 hartree
pointgroup: C01 [X(C14H25N1O3Si1)]
dipole: -1.8425331 0.093318 0.6371414 debye
polarizability: 262.4096675|-1.8021887|157.1192513|-2.0857388|3.6605282|182.5858969 unknown
InChI: InChI=1S/C14H25NO3Si/c1-6-16-19(17-7-2,18-8-3)14-11-9-13(10-12-14)15(4)5/h9-12H,6-8H2,1-5H3
charge 0 multiplicity 1
44 atoms
Si 1.660615 -0.048845 -0.184489
O  2.292729 1.200659 -1.19187
O  2.267847 -1.443003 -0.999843
O  2.281158 0.06298 1.42341
N  -4.465216 0.075856 0.44019
C  -0.201561 -0.017332 0.014494
C  -1.061074 -0.145945 -1.112646
C  -0.813701 0.139955 1.288144
C  -3.075018 0.043451 0.301426
C  -2.460791 -0.117265 -0.983609
C  -2.211307 0.170277 1.438057
C  1.8739 2.607232 -1.116625
C  1.958068 -2.819541 -0.587814
C  3.709778 0.113324 1.764185
C  -5.068085 0.25545 1.766882
C  -5.326768 -0.066495 -0.740016
C  2.357228 3.306964 -2.387706
C  2.509258 -3.76085 -1.659345
C  3.83103 0.390926 3.262843
H  -0.631559 -0.271545 -2.115176
H  -0.176162 0.238483 2.17422
H  -3.075633 -0.21846 -1.882482
H  -2.630863 0.291626 2.440875
H  0.769127 2.674678 -1.024138
H  2.321002 3.078694 -0.216714
H  2.425888 -3.029776 0.3970
H  0.860081 -2.946517 -0.477701
H  4.184934 -0.854002 1.501258
H  4.207947 0.907324 1.170669
H  -4.750588 1.208577 2.236656
H  -4.800621 -0.570105 2.457869
H  -6.165106 0.274751 1.671281
H  -5.160273 -1.033412 -1.257305
H  -5.157688 0.746183 -1.475997
H  -6.382799 -0.027165 -0.429745
H  2.084878 4.379341 -2.36861
H  3.454018 3.22203 -2.476545
H  1.903232 2.840463 -3.27886
H  2.313474 -4.815691 -1.388403
H  2.035995 -3.550778 -2.633924
H  3.59828 -3.619099 -1.768545
H  3.32546 -0.401352 3.841988
H  3.36052 1.357278 3.514596
H  4.894468 0.425677 3.566164
