program: Gaussian 09
title: 000087559
version: EM64L-G09RevD.01
frameworkgroup: C1[X(C7H18O2Si)]
method: RPBEPBE
basis: SDD
operation: Freq
keyword: #p
keyword: freq=noraman
keyword: PBEPBE/SDD
title: #p freq=noraman PBEPBE/SDD
converged: YES YES NO NO
title: Mulliken charges:
elementType: Si O O C C C C C C C H H H H H H H H H H H H H H H H H H
charge: 1.473834 -0.583158 -0.592679 -0.866922 -0.024658 -1.068808 -0.689367 -0.697303 -0.490545 -0.487096 0.237527 0.241109 0.197736 0.242325 0.257188 0.251044 0.199072 0.201989 0.261160 0.206506 0.210238 0.214698 0.228585 0.209292 0.213977 0.217697 0.228332 0.208226
chargesum: 0.00000
title: Mulliken charges with hydrogens summed into heavy atoms:
elementType: Si O O C C C C C C C
charge: 1.473834 -0.583158 -0.592679 -0.388286 0.173078 -0.318251 -0.027145 -0.065860 0.161309 0.167159
polarizability: 1.15900196e+02 -1.24059419e+00 1.02446743e+02 1.36321592e+00 9.89809297e-01 9.61468119e+01
1716.lowfreq: -7.5803 -4.6165 -0.0008 0.0004 0.0011 12.8491 30.6304 51.8200 59.8204
frequency: 28.5447 51.4343 59.6587 69.5844 80.7891 86.8333 104.0204 106.7675 139.4565 146.5499 195.7682 215.8822 226.8121 240.9865 251.8119 279.3548 341.2836 366.1203 399.9471 421.9043 568.9383 660.3619 696.0099 738.8668 801.4979 816.4674 864.3597 879.3138 922.1720 953.6553 963.2075 1036.1468 1042.6417 1054.7687 1108.0199 1119.5459 1120.2376 1143.8773 1144.7491 1174.6951 1212.8266 1233.5349 1310.1309 1323.4442 1327.2816 1376.6684 1398.9307 1420.4542 1439.5901 1441.4974 1442.7044 1449.5059 1466.0679 1470.6659 1471.1617 1473.1110 1473.3749 1475.3561 1479.8447 1490.4907 2941.0203 2944.0004 2951.1216 2963.6859 2965.6484 2971.2669 2994.1664 3022.4455 3026.7631 3027.5213 3058.2925 3064.7595 3066.5982 3079.3502 3081.5190 3082.6325 3097.9436 3100.2842
redmass: 2.5846 1.4990 1.6900 2.4153 2.5318 1.1190 2.4184 1.1816 2.7567 3.2324 2.2895 1.0623 3.9700 2.1046 1.7367 2.3325 3.4257 2.8850 2.4217 2.7114 4.6573 4.7740 3.8077 2.2141 2.6141 2.3648 1.5024 1.6414 1.1706 1.5380 1.7963 7.1597 6.5430 1.2963 2.0707 1.2629 1.2641 1.3798 1.3929 1.7957 1.4646 1.3622 1.2112 1.5003 1.3249 1.2048 1.1975 1.0858 1.0882 1.0819 1.1057 1.0627 1.0451 1.0538 1.0527 1.0521 1.0515 1.0525 1.0469 1.0501 1.0321 1.0322 1.0822 1.0408 1.0518 1.0378 1.0348 1.1030 1.0993 1.1029 1.0995 1.0998 1.0986 1.0998 1.1002 1.1002 1.0978 1.0985
irintensity: 0.1402 0.4983 1.8673 1.0962 1.7015 0.6356 7.0521 0.1136 1.4352 11.5689 1.7379 0.1734 13.3838 3.6971 1.0046 5.5567 15.7233 17.3073 8.3219 10.5217 9.0675 52.4394 29.1465 17.0161 78.2774 4.2546 92.2605 88.6285 2.3635 1.4383 0.9775 222.8484 197.4794 21.6467 23.0666 0.9068 1.0241 22.8853 24.2195 10.6070 1.2443 22.8022 54.7418 2.0451 12.4029 14.8873 16.6227 6.3662 3.7575 2.5876 2.1002 12.5975 2.0894 5.3626 14.8437 4.8296 6.2469 8.5800 11.6364 12.6548 88.6642 80.0928 16.7931 24.6623 40.0028 33.0093 5.7074 57.6375 16.0755 53.9317 5.3049 41.2560 97.4980 47.0082 35.3796 20.2474 10.7635 13.4497
temp: 298.150 k
press: 1.00000 atm
elementType: 14 8 8 6 6 6 6 6 6 6 1 1 1 1 1 1 1 1 1 1 1 1 1 1 1 1 1 1
symmnumber: 1
zpe: 629467.2 jmol-1
zpe.correction: 0.239751 hartree
zpe.thermalcorrener: 0.255868 hartree
zpe.thermalcorrenthalpy: 0.256812 hartree
zpe.thermalcorrgfe: 0.195146 hartree
zpe.sumelectzpe: -716.569630 hartree
zpe.sumelectthermal: -716.553514 hartree
zpe.sumelectthermalent: -716.552569 hartree
zpe.sumelectthermalfe: -716.614235 hartree
dipole: -0.0311 -0.0151 -0.1023
dipole: 0.1080
quadrupole: -69.9937 -68.9132 -70.6539
quadrupole: -3.1183 3.7250 3.8465
quadrupole: -0.1401 0.9404 -0.8003 -3.1183 3.7250 3.8465
hfenergy: -716.8093818 hartree
pointgroup: C01 [X(C7H18O2Si1)]
dipole: -0.0130047 -0.0077445 -0.0396907 debye
polarizability: 116.0038487|-0.8553836|102.4648394|0.9109488|0.8007485|96.0250629 unknown
InChI: InChI=1S/C7H18O2Si/c1-7(2)6-10(5,8-3)9-4/h7H,6H2,1-5H3
charge 0 multiplicity 1
28 atoms
Si -0.688582 -0.089226 0.429228
O  -1.947476 -1.289655 0.339311
O  -1.061208 1.217798 -0.661517
C  0.98356 -0.792184 -0.149474
C  2.235732 0.102698 0.10023
C  -0.755995 0.474798 2.234705
C  2.266179 1.317637 -0.858839
C  3.531831 -0.732932 -0.040626
C  -2.252684 -2.080867 -0.84809
C  -2.275666 2.025415 -0.589866
H  1.110108 -1.760685 0.379077
H  0.919939 -1.033169 -1.230332
H  2.195848 0.484315 1.143506
H  -0.099849 1.345589 2.410445
H  -1.787837 0.753808 2.512187
H  -0.439317 -0.340888 2.908606
H  2.395192 0.974304 -1.903767
H  3.111169 1.988733 -0.615721
H  1.324807 1.893093 -0.815382
H  3.604637 -1.164974 -1.057502
H  3.558212 -1.566927 0.685788
H  4.428331 -0.105984 0.124777
H  -3.148162 -2.681167 -0.615005
H  -1.420249 -2.767698 -1.104569
H  -2.466394 -1.438868 -1.726499
H  -3.186346 1.397883 -0.661532
H  -2.249482 2.723355 -1.443402
H  -2.321299 2.611995 0.350566
