program: Gaussian 09
title: 000087495
version: EM64L-G09RevD.01
frameworkgroup: C1[X(C6H16O2Si)]
method: RPBEPBE
basis: SDD
operation: Freq
keyword: #p
keyword: freq=noraman
keyword: PBEPBE/SDD
title: #p freq=noraman PBEPBE/SDD
converged: YES YES NO NO
title: Mulliken charges:
elementType: Si O O C C C C C C H H H H H H H H H H H H H H H H
charge: 1.402790 -0.600584 -0.285362 -1.034483 -1.045343 -1.045117 -0.248699 -0.261219 -0.493157 0.249186 0.228369 0.249211 0.246929 0.237187 0.239511 0.237152 0.246970 0.239430 0.202120 0.201816 0.199768 0.199574 0.231386 0.201277 0.201289
chargesum: 0.00000
title: Mulliken charges with hydrogens summed into heavy atoms:
elementType: Si O O C C C C C C
charge: 1.402790 -0.600584 -0.285362 -0.307718 -0.321716 -0.321564 0.155237 0.138123 0.140795
polarizability: 1.14742139e+02 1.66456140e+00 8.85401034e+01 5.92991563e-04 4.06503770e-03 8.74469172e+01
1716.lowfreq: -26.7312 -10.0295 -0.0016 0.0014 0.0022 6.7209 27.8279 35.9302 65.4415
frequency: 27.0021 35.2981 65.4084 85.5292 89.5698 108.3122 125.9781 135.8837 160.9776 179.0354 185.8864 213.1846 226.1079 258.6443 294.0216 340.9708 430.9209 580.9293 689.4926 698.4060 705.0826 737.9230 798.1016 815.4371 828.6578 899.3328 906.6500 910.5957 927.3220 1033.1741 1069.5414 1098.1536 1101.3125 1122.6844 1162.0308 1171.8901 1264.2776 1296.6692 1298.5941 1310.3268 1327.0503 1389.5938 1435.2669 1438.4242 1444.8333 1446.7120 1448.2721 1449.4203 1457.3993 1462.6062 1469.3771 1484.1774 1492.9304 2921.6233 2941.8873 2949.6996 2980.6561 2982.0538 2986.4231 2990.2928 2995.0603 3019.4563 3079.4622 3081.8034 3089.9140 3090.1312 3093.6666 3099.2969 3099.4191
redmass: 3.5751 1.9823 3.3511 1.3797 1.6282 2.1082 1.0396 1.0309 2.9166 2.6542 2.5820 2.7130 1.2251 3.5738 3.7064 4.8521 3.1377 4.2677 2.9319 5.3654 2.7371 1.1703 1.3579 1.3987 1.1098 4.6888 1.6255 1.5482 1.6737 6.9268 6.8549 1.3367 3.3005 1.3725 1.5075 1.1366 1.1401 1.2059 1.2099 1.1940 1.2424 1.3958 1.0541 1.1579 1.0546 1.0550 1.0481 1.0487 1.0515 1.0476 1.0617 1.0722 1.0828 1.0351 1.0546 1.0541 1.0355 1.0346 1.1037 1.0345 1.1028 1.1108 1.0977 1.0972 1.0986 1.0983 1.0979 1.0983 1.0971
irintensity: 0.8361 2.3941 0.7659 0.3159 1.0722 9.7699 0.0010 0.0082 5.6388 0.4645 0.7840 2.4412 3.4134 21.2202 4.3398 3.9970 8.2819 0.1688 13.8259 33.5675 6.9999 0.0423 23.8886 19.8836 0.1566 10.1342 114.0358 114.1315 211.5979 81.8865 312.6938 0.1111 4.8344 0.0777 9.5735 4.7036 1.0794 56.4589 59.1170 18.4131 8.6242 0.0520 0.5230 0.4226 0.9272 0.0625 6.4658 12.2169 12.0328 21.8082 12.8495 3.2780 8.2238 82.4911 26.3333 88.5632 12.4001 11.3638 7.2369 9.8768 76.3791 104.0680 0.3244 35.1874 9.1729 12.7269 26.1247 15.4411 35.0831
temp: 298.150 k
press: 1.00000 atm
elementType: 14 8 8 6 6 6 6 6 6 1 1 1 1 1 1 1 1 1 1 1 1 1 1 1 1
symmnumber: 1
zpe: 553489.5 jmol-1
zpe.correction: 0.210813 hartree
zpe.thermalcorrener: 0.225548 hartree
zpe.thermalcorrenthalpy: 0.226492 hartree
zpe.thermalcorrgfe: 0.167685 hartree
zpe.sumelectzpe: -677.317923 hartree
zpe.sumelectthermal: -677.303188 hartree
zpe.sumelectthermalent: -677.302244 hartree
zpe.sumelectthermalfe: -677.361051 hartree
dipole: 0.5253 0.2378 0.0090
dipole: 0.5767
quadrupole: -55.3374 -66.4570 -64.5848
quadrupole: -5.3167 -0.0144 -0.0010
quadrupole: 6.7890 -4.3306 -2.4584 -5.3167 -0.0144 -0.0010
hfenergy: -677.528736 hartree
pointgroup: C01 [X(C6H16O2Si1)]
dipole: 0.2095421 0.0869526 0.0023412 debye
dipolederiv: 1.9300967 0.1065382 -0.0016031 -0.1439385 1.3797168 0.0015919 0.0023723 0.0013604 1.4780609 -1.7528244 -0.0988829 0.0017969 -0.1530938 -0.5941054 -0.0006837 0.0030758 -0.0008025 -0.6355954 -1.1845064 0.0440312 -0.0001859 -0.0095557 -0.4141231 -0.0002406 0.0000888 -0.0002345 -0.4373147 -0.3525163 -0.0821555 0.0014669 -0.1110106 -0.4601904 0.0027924 0.0021298 0.0028796 -0.3282822 -0.3725691 -0.0047548 0.0272417 0.0546638 -0.3932745 -0.096609 0.0476876 -0.1073009 -0.475796 -0.3729518 -0.005229 -0.0277116 0.0528095 -0.3856728 0.0930426 -0.0502362 0.1038941 -0.4832532 0.8509806 0.0972765 -0.001073 0.4355243 0.2935217 0.0010453 -0.0068147 0.0012854 0.389083 0.6285481 0.132937 -0.0016196 0.2781748 0.3047401 0.0014985 -0.0026984 0.0013346 0.4251551 0.6781362 -0.1151503 0.0009803 -0.3097957 0.3072773 0.0007455 0.0028416 0.0006918 0.3775958 0.1171279 0.0167192 0.0139426 0.0261217 0.0061377 -0.132795 0.025331 -0.1129591 -0.0299523 -0.1586143 0.0217676 0.000213 0.01197 0.1108752 -0.0001274 0.0004041 -0.0001198 0.1081315 0.1169311 0.0166848 -0.0152824 0.0258444 0.0154618 0.1308349 -0.0271077 0.1111069 -0.0390751 0.1068137 0.0147426 -0.0394074 0.0092259 0.0697613 0.0739297 -0.0489855 0.0996975 -0.1028995 -0.131279 0.0742228 0.032226 0.0916502 0.0908696 -0.0039293 0.0584758 -0.0034935 0.1094492 0.0586243 -0.1126777 -0.020795 -0.1260336 -0.0832176 -0.0092292 -0.0279469 -0.0320655 0.1022771 -0.1319422 0.0723657 -0.0343159 0.0888638 0.0915419 0.0043821 -0.0611825 0.0038934 0.1093103 0.1070454 0.0159679 0.0383544 0.0109365 0.0630718 -0.0801887 0.0482857 -0.105837 -0.0962949 0.0593874 -0.1113963 0.0250998 -0.1243577 -0.0820202 0.0166555 0.0327116 0.0393629 0.1003946 -0.0143133 -0.0111661 0.0113182 -0.0692416 -0.0607713 -0.1051019 -0.0228728 -0.1306043 -0.0932443 -0.0145964 -0.0107492 -0.011487 -0.0680189 -0.0550408 0.1043926 0.024329 0.1299082 -0.0994159 -0.0144264 -0.0005497 -0.0308612 -0.0582499 -0.0536632 0.1061064 0.0075991 0.1401966 -0.1168468 -0.0146889 0.00038 0.0310461 -0.0580395 -0.0590292 -0.1075151 -0.0062048 -0.1416193 -0.111897 -0.1225184 -0.0914178 0.0007836 -0.131406 -0.0130426 0.0010612 0.0011271 0.0010728 0.1115958 -0.0079154 0.0153387 0.0142635 0.1378159 -0.0368635 0.1386966 -0.0685605 0.1414867 -0.1331413 -0.0080291 0.0151568 -0.014391 0.139141 -0.0419607 -0.1403549 0.0661508 -0.1431343 -0.128045 unknown
polarizability: 114.8217348|0.8235969|88.4604296|-0.023787|-0.0092713|87.4469956 unknown
InChI: InChI=1S/C6H16O2Si/c1-7-5-6-8-9(2,3)4/h5-6H2,1-4H3
charge 0 multiplicity 1
25 atoms
Si 2.079231 -0.054804 0.002097
O  0.411336 0.492396 -0.005685
O  -3.149749 -0.405482 0.007517
C  3.063052 1.567049 -0.030612
C  2.409121 -1.124263 -1.545589
C  2.414956 -1.06487 1.5877
C  -0.7452 -0.398857 0.008335
C  -1.98884 0.491292 -0.001124
C  -4.411891 0.327467 0.000508
H  2.818218 2.18586 0.850861
H  4.152353 1.379577 -0.029764
H  2.813787 2.151795 -0.933795
H  2.16128 -0.565671 -2.466289
H  3.474334 -1.41756 -1.601367
H  1.80716 -2.05165 -1.535961
H  3.481094 -1.353157 1.65156
H  2.168114 -0.472642 2.487389
H  1.815559 -1.993609 1.614714
H  -0.757309 -1.060582 -0.882932
H  -0.753857 -1.037526 0.916341
H  -1.987889 1.131671 -0.909368
H  -1.988906 1.150408 0.893618
H  -5.211823 -0.429903 0.007031
H  -4.512063 0.960059 -0.907898
H  -4.512666 0.976301 0.89731
