program: Gaussian 09
title: 000087499
version: EM64L-G09RevD.01
frameworkgroup: C1[X(C10H13NO2)]
method: RPBEPBE
basis: SDD
operation: Freq
keyword: #p
keyword: freq=noraman
keyword: PBEPBE/SDD
title: #p freq=noraman PBEPBE/SDD
converged: YES YES NO NO
title: Mulliken charges:
elementType: O O N C C C C C C C C C C H H H H H H H H H H H H H
charge: -0.300259 -0.331538 -0.684360 0.046577 0.069944 -0.687314 -0.685401 0.324928 0.237339 -0.317797 -0.395555 -0.267537 -0.195621 0.231974 0.221250 0.207605 0.233485 0.210574 0.252640 0.219642 0.266274 0.217753 0.228136 0.223758 0.374083 0.299421
chargesum: 0.00000
title: Mulliken charges with hydrogens summed into heavy atoms:
elementType: O O N C C C C C C C C C C
charge: -0.300259 -0.331538 -0.010856 0.278551 0.069944 -0.024974 -0.002545 0.324928 0.237339 -0.051523 -0.177802 -0.039401 0.028136
polarizability: 1.76358877e+02 -2.47881705e+00 1.37317663e+02 1.90158439e+00 -3.96718943e+00 6.82103856e+01
1716.lowfreq: -4.1280 0.0004 0.0007 0.0008 3.9732 12.8649 46.1502 58.1101 100.4278
frequency: 45.9466 58.0961 100.4269 112.5348 145.7761 195.4343 231.3863 236.1328 248.9807 291.0528 367.6785 393.8751 412.3586 429.3744 449.6350 464.8854 490.6692 525.4599 554.4336 654.8666 677.1660 729.7413 758.2806 773.8259 780.3982 782.7183 850.8995 853.4299 905.1139 926.1221 941.6058 961.9504 982.7184 1019.8677 1042.4943 1060.6755 1103.6107 1152.9049 1157.2156 1174.0128 1182.1216 1253.9618 1287.1352 1327.4620 1330.7479 1339.0561 1379.9961 1395.4949 1403.0308 1443.1522 1456.3964 1464.9794 1472.7105 1485.1057 1487.8995 1533.7437 1577.8936 1616.7157 1634.1626 2987.5300 2991.2572 3030.7054 3082.4861 3091.8720 3097.0842 3103.1106 3118.7848 3139.7166 3157.0900 3178.5103 3402.0525 3648.9336
redmass: 3.0033 3.7688 5.7535 3.7488 5.2594 1.0221 1.3371 2.8706 3.3729 3.5181 3.1249 3.7748 4.9915 2.6208 2.3396 1.4027 3.2638 3.1087 6.7263 6.7074 4.4798 1.3032 1.6473 4.5163 2.0409 4.7467 4.9493 1.5175 2.6937 1.2330 1.3620 1.3623 1.3243 2.4093 3.5089 2.0055 1.7009 1.3057 2.0388 1.0825 1.8768 2.5948 1.8370 1.7247 1.9082 1.3537 1.2672 1.2442 5.8919 2.9848 1.0622 1.0516 1.0544 2.4175 1.0621 3.9688 6.9814 1.4704 7.1935 1.0356 1.0358 1.0864 1.0994 1.0987 1.1005 1.1006 1.0864 1.0917 1.0935 1.0978 1.0559 1.0946
irintensity: 0.2475 3.3020 0.2129 1.4390 0.0761 0.0365 1.7066 3.9062 1.1473 8.9697 3.5234 6.7827 5.2161 27.6330 23.4494 98.6114 3.7270 24.0371 1.3037 8.5561 17.3357 89.7326 126.6590 7.2365 5.5582 1.1009 6.0551 1.8571 14.2180 2.4774 0.1238 1.9511 0.0031 12.3416 206.8273 173.4669 76.2097 16.6943 12.8084 46.7383 34.9757 423.6755 10.8861 42.1344 4.7865 6.1482 35.1827 19.5946 7.7319 4.0773 6.7715 6.9014 4.5362 38.7775 24.1727 247.4532 84.7223 114.7215 207.9914 16.8466 27.2750 6.0252 5.6885 61.3578 21.6403 29.9424 8.2726 22.9578 18.0773 12.5535 114.6149 55.2244
temp: 298.150 k
press: 1.00000 atm
elementType: 8 8 7 6 6 6 6 6 6 6 6 6 6 1 1 1 1 1 1 1 1 1 1 1 1 1
symmnumber: 1
zpe: 557128.8 jmol-1
zpe.correction: 0.212199 hartree
zpe.thermalcorrener: 0.225053 hartree
zpe.thermalcorrenthalpy: 0.225997 hartree
zpe.thermalcorrgfe: 0.172914 hartree
zpe.sumelectzpe: -593.121610 hartree
zpe.sumelectthermal: -593.108757 hartree
zpe.sumelectthermalent: -593.107813 hartree
zpe.sumelectthermalfe: -593.160895 hartree
dipole: 0.1747 0.1219 0.0790
dipole: 0.2272
quadrupole: -60.1586 -72.0710 -80.8359
quadrupole: 5.5313 0.1050 -0.5552
quadrupole: 10.8632 -1.0492 -9.8140 5.5313 0.1050 -0.5552
hfenergy: -593.3338095 hartree
pointgroup: C01 [X(C10H13N1O2)]
dipole: -0.0686648 0.0523958 -0.0230104 debye
dipolederiv: -1.9222761 0.3417715 0.1599072 0.721318 -0.6075589 -0.0462594 0.1222731 -0.0033158 -0.3384984 -0.8789057 -0.1641082 0.0000364 -0.1813704 -0.9281291 -0.0979096 -0.0089916 -0.0913826 -0.3593876 -0.2468577 -0.1733294 -0.03756 0.0910988 -1.3214247 -0.1196239 0.0077923 -0.1084416 -0.67527 1.2084993 -0.1389347 -0.0873795 0.0721091 0.2551598 -0.0706014 0.0008279 -0.0986638 0.3984955 -1.0098528 0.1250604 0.0573764 -0.4943694 -0.3653052 -0.0276251 -0.0497618 -0.0490993 -0.0931063 -0.0867244 0.0741026 0.0017838 0.0552735 -0.0346092 0.0823153 -0.0237595 0.0841009 0.0103013 -0.1309147 0.0504132 0.027836 -0.0263938 0.0007495 0.091087 0.0243984 0.115662 -0.1269232 0.1219693 0.3436882 0.0558224 -0.2049551 1.2838198 0.2004187 -0.0298531 0.1755977 0.1746755 2.4468561 -0.0262087 -0.1098528 -0.333434 1.1037916 0.1793074 -0.1038297 0.1393596 0.2528901 0.3695939 -0.0043811 -0.0123331 0.5668723 0.1385476 0.0166924 0.0759045 0.0338968 -0.0820449 0.0817843 -0.4734202 -0.0857169 0.060574 -0.3617596 -0.0242886 0.0015393 -0.0089536 -0.2329778 -0.6834779 0.088655 0.030999 0.0533302 -0.0346891 0.0309975 0.0188892 0.0314707 -0.228674 0.2946309 -0.0291293 -0.0144336 -0.3433285 0.3036548 0.0788746 -0.0657779 0.0668522 -0.0920915 -0.0223703 0.0317111 0.0226623 -0.0812137 -0.0214992 -0.0753292 -0.0131515 -0.0534021 -0.0438678 0.1100935 -0.0399508 -0.0388848 0.0195964 -0.0412296 -0.0820893 -0.0154829 -0.1333893 -0.016799 -0.1893184 -0.0220502 -0.0162819 -0.048459 0.0627996 -0.0035786 -0.0032587 0.0027665 0.1096659 0.110225 -0.0275363 0.0764065 0.0009348 0.0489145 0.0725597 0.0554587 0.0773964 -0.1098369 -0.1950334 -0.0624142 0.0220865 -0.0741661 0.101968 0.0024856 0.0345292 -0.0132221 0.0762067 0.0766049 0.1045057 -0.055631 0.0984271 -0.0345708 0.0678297 -0.0583942 0.0377566 0.0586355 0.1142 -0.0429158 -0.0249232 -0.0100179 -0.0421243 -0.1345148 -0.0004089 -0.0668713 -0.0212743 0.060226 0.0875498 0.0154549 0.0837975 0.0539312 -0.0185443 0.0170093 -0.0168862 0.1406172 -0.0434524 0.0752798 0.0177375 0.13186 -0.0340209 -0.0362954 0.0262271 -0.0343805 0.1612906 0.0617972 -0.0309946 -0.0020802 -0.0526918 -0.11405 -0.0454838 -0.005316 -0.0466899 0.1666463 -0.1189859 -0.0759898 -0.0056105 -0.0790251 0.074584 -0.0099961 -0.0063782 -0.0103316 0.1467588 0.3691313 -0.0319926 -0.0078255 -0.0190873 0.2704998 -0.0115486 -0.0051099 -0.0104587 0.3604849 0.1025579 0.0206187 0.0104041 -0.0066799 0.2425505 -0.0188798 0.004625 -0.019371 0.3640833 unknown
polarizability: 176.3386134|1.6074296|136.196844|-4.4076341|9.0474842|69.3514683 unknown
InChI: InChI=1S/C10H13NO2/c1-7(2)13-10(12)8-5-3-4-6-9(8)11/h3-7H,11H2,1-2H3
charge 0 multiplicity 1
26 atoms
O  1.597524 -0.464288 -0.175749
O  0.974148 1.756834 0.155949
N  -1.644556 2.296992 0.317303
C  3.043103 -0.039039 -0.161358
C  -0.74298 0.035649 -0.06906
C  3.818986 -1.270398 0.3113
C  3.430787 0.443242 -1.56663
C  -1.849522 0.948793 0.103927
C  0.640403 0.539284 -0.019138
C  -1.005428 -1.347566 -0.288678
C  -3.179052 0.419947 0.049034
C  -2.315349 -1.846179 -0.340538
C  -3.403799 -0.946216 -0.168579
H  3.128457 0.794667 0.559864
H  3.689537 -2.109693 -0.394913
H  4.896312 -1.032613 0.376427
H  3.471371 -1.595347 1.306846
H  4.498105 0.731625 -1.585606
H  2.831638 1.322564 -1.856633
H  3.2740 -0.359953 -2.308504
H  -0.148543 -2.014748 -0.416835
H  -4.026096 1.104449 0.180217
H  -2.498651 -2.911367 -0.511339
H  -4.433264 -1.321437 -0.205701
H  -0.675272 2.636223 0.344826
H  -2.435359 2.924075 0.438267
