program: Gaussian 09
title: 000087493
version: EM64L-G09RevD.01
frameworkgroup: C1[X(C3H7Cl3Si)]
method: RPBEPBE
basis: SDD
operation: Freq
keyword: #p
keyword: freq=noraman
keyword: PBEPBE/SDD
title: #p freq=noraman PBEPBE/SDD
converged: YES YES NO NO
title: Mulliken charges:
elementType: Cl Cl Cl Si C C C H H H H H H H
charge: -0.305119 0.026307 -0.011799 1.130186 -0.793440 -0.984276 -0.979658 0.352984 0.257030 0.261101 0.260523 0.275946 0.256333 0.253881
chargesum: 0.00000
title: Mulliken charges with hydrogens summed into heavy atoms:
elementType: Cl Cl Cl Si C C C
charge: -0.305119 0.026307 -0.011799 1.130186 -0.440455 -0.205622 -0.193498
polarizability: 8.77318559e+01 -7.35088004e+00 9.33331621e+01 -4.82381093e+00 -1.55702710e+00 6.69154681e+01
1716.lowfreq: -12.6883 -2.9384 0.0011 0.0016 0.0017 11.7776 41.5185 94.7289 126.0353
frequency: 41.2339 94.7250 126.0248 129.0819 143.4414 162.2915 165.5808 192.7885 231.2331 246.5699 312.1744 436.1225 558.3098 614.6210 654.8202 734.9721 768.2722 826.2612 844.4522 898.5750 927.5069 1129.7602 1177.5936 1311.5546 1319.7622 1433.8820 1440.4005 1442.4199 1450.8365 2995.9254 2997.6890 3101.2378 3103.8395 3107.3632 3116.3320 3116.6262
redmass: 8.1585 9.9759 2.0710 1.0777 1.3221 4.3038 3.9749 3.1632 5.1928 8.2083 8.5163 9.3870 6.0015 8.8958 5.2717 2.7501 3.5216 1.2390 1.7984 1.4269 1.4752 1.1721 1.0630 1.1934 1.1836 1.0499 1.0518 1.0466 1.0463 1.0342 1.0345 1.0984 1.0986 1.0988 1.0988 1.0876
irintensity: 1.5873 3.5514 2.6654 0.0049 0.4629 0.8119 2.1098 3.5503 4.1566 8.4350 10.6870 51.4598 17.4330 59.1266 47.6188 8.1522 3.7178 0.4369 58.9904 117.6983 94.6975 2.0750 3.5918 48.9627 21.9650 5.3346 1.2961 11.1513 18.6829 2.7308 2.8935 1.8199 7.6776 5.1231 2.5611 0.7676
temp: 298.150 k
press: 1.00000 atm
elementType: 17 17 17 14 6 6 6 1 1 1 1 1 1 1
symmnumber: 1
zpe: 247353.5 jmol-1
zpe.correction: 0.094212 hartree
zpe.thermalcorrener: 0.105144 hartree
zpe.thermalcorrenthalpy: 0.106088 hartree
zpe.thermalcorrgfe: 0.056216 hartree
zpe.sumelectzpe: -1787.571062 hartree
zpe.sumelectthermal: -1787.560130 hartree
zpe.sumelectthermalent: -1787.559185 hartree
zpe.sumelectthermalfe: -1787.609058 hartree
dipole: 0.1747 2.6533 0.6351
dipole: 2.7338
quadrupole: -79.5523 -71.4893 -67.2707
quadrupole: 4.1254 2.6451 -0.0970
quadrupole: -6.7815 1.2815 5.5000 4.1254 2.6451 -0.0970
hfenergy: -1787.6652736 hartree
pointgroup: C01 [X(C3H7Cl3Si1)]
dipole: -0.3598012 0.9851972 -0.238237 debye
dipolederiv: -0.54622 -0.1737326 0.0860679 -0.1784029 -0.6078855 0.1225074 0.0724775 0.118138 -0.4489262 -0.3233438 0.2818061 0.0681216 0.1850426 -0.5556709 -0.0980682 0.0402254 -0.1632231 -0.1474482 -0.4142274 -0.3104361 0.0283871 -0.190212 -0.6177668 0.0169854 0.0069299 0.08018 -0.1363358 1.5528021 0.11712 -0.1248643 0.1324287 1.3322851 -0.1029371 0.0553514 -0.1080114 1.2749591 0.2508018 0.0612226 -0.0840709 0.0076651 0.9214761 0.0791207 -0.1086773 0.0811822 -0.043408 -0.41015 0.0609428 0.0221842 0.0501314 -0.3924762 -0.0438428 -0.0220794 -0.0163691 -0.3487802 -0.356497 0.0055146 0.028477 0.0235125 -0.3340504 -0.0048685 -0.0258735 -0.0180705 -0.4480943 -0.008473 -0.00615 -0.0229593 0.0035485 -0.0276615 -0.0040139 -0.0212323 -0.0074126 -0.0234656 0.0912142 -0.0597948 0.0277327 -0.0824185 -0.0473717 0.0645676 0.0240354 0.0331397 0.0980744 -0.0850952 0.0239138 -0.0464848 0.0715093 0.0966838 0.0073857 -0.024746 -0.0073535 0.1075151 0.1266223 -0.0012881 0.0028771 -0.0128958 0.1030502 -0.0423473 -0.0114647 -0.0163028 -0.0922538 0.1020174 0.0623471 0.0340555 0.0495443 -0.0072853 -0.0553778 0.0528239 -0.0719311 0.0828601 -0.0504591 0.0138162 -0.0643598 0.0117012 0.1223415 0.0067397 -0.1063873 0.012057 0.0778032 0.0710078 -0.0752817 0.0448361 -0.0711543 0.0143315 0.0541491 0.0686172 0.0839772 0.0475001 unknown
polarizability: 83.5429591|4.8059392|96.6828355|-6.3488411|-0.5435158|67.7546916 unknown
InChI: InChI=1S/C3H7Cl3Si/c1-7(2,6)3(4)5/h3H,1-2H3
charge 0 multiplicity 1
14 atoms
Cl -1.855119 -1.584103 0.789047
Cl 1.874927 -1.588615 -0.125088
Cl 2.009956 1.485023 0.139815
Si -0.758301 0.13838 -0.076059
C  1.041052 -0.079941 0.592202
C  -1.542759 1.699025 0.655644
C  -0.807335 -0.010022 -1.957503
H  1.129273 -0.173354 1.68335
H  -1.043134 2.604825 0.268676
H  -2.612386 1.744003 0.385037
H  -1.470262 1.702358 1.756872
H  -0.38403 -0.975569 -2.28103
H  -1.847096 0.05444 -2.322447
H  -0.219785 0.802851 -2.421716
