program: Gaussian 09
title: 000087583
version: EM64L-G09RevD.01
frameworkgroup: C1[X(C17H20O4)]
method: RPBEPBE
basis: SDD
operation: Freq
keyword: #pfreq=noraman
keyword: PBEPBE/SDD
title: #p freq=noraman PBEPBE/SDD
converged: YES YES NO NO
title: Mulliken charges:
elementType: O O O O C C C C C C C C C C C C C C C C C H H H H H H H H H H H H H H H H H H H H
charge: -0.282090 -0.246473 -0.210397 -0.198867 -0.357143 -0.352510 -0.366460 -0.354745 -0.522168 -0.694473 0.207754 0.231677 0.226922 0.389259 0.405274 -0.558673 -0.363219 -0.351038 -0.480364 -0.805499 0.125756 0.188991 0.188435 0.190489 0.190771 0.215956 0.216135 0.195023 0.195095 0.254086 0.254902 0.210498 0.210530 0.216938 0.294722 0.247350 0.305902 0.255294 0.241469 0.242602 0.242290
chargesum: 0.00000
title: Mulliken charges with hydrogens summed into heavy atoms:
elementType: O O O O C C C C C C C C C C C C C C C C C
charge: -0.282090 -0.246473 -0.210397 -0.198867 0.020283 0.028749 0.065631 0.035373 -0.013180 -0.056508 0.207754 0.231677 0.226922 0.389259 0.405274 -0.263952 -0.115870 -0.045137 -0.225070 -0.079137 0.125756
polarizability: 3.39761007e+02 -2.15171654e+01 2.00189779e+02 1.22881233e+00 2.01698853e-01 1.09254445e+02
1716.lowfreq: -1.9029 -0.0010 -0.0002 0.0014 4.5651 11.3756 18.7615 31.0852 32.4367
frequency: 18.1812 31.0402 32.3998 41.9510 53.3002 80.2704 94.6106 99.2237 112.5677 133.6305 142.8718 158.7397 162.1408 176.6822 204.9349 226.1979 245.5914 256.0780 278.6066 298.7209 320.0756 350.9881 401.2729 424.2791 447.4714 454.3224 499.8563 520.8349 528.1168 546.3068 551.9141 627.0226 646.2186 670.8629 689.3674 707.5294 723.2951 735.4571 745.8553 752.8856 790.3451 790.4861 837.8232 861.2561 876.9885 878.5929 889.7078 891.0150 960.5703 977.4387 979.8433 996.5944 1011.4905 1032.0395 1045.8960 1053.6841 1069.9453 1077.2868 1084.3017 1108.4451 1111.0603 1122.0679 1132.1462 1172.0560 1192.2698 1219.3889 1233.6646 1240.0746 1246.9926 1262.7628 1279.5496 1286.6881 1291.1176 1296.5472 1332.9351 1357.1483 1364.6588 1378.3402 1387.2202 1389.0108 1400.1631 1422.2982 1434.3812 1464.4874 1466.6384 1466.9181 1468.9650 1473.9683 1476.3850 1482.1825 1489.3092 1494.0170 1546.9060 1605.0548 1624.4093 1661.0534 1687.9323 2952.5986 2958.1000 2968.9384 2972.6054 2981.9264 2984.9452 2990.0478 2995.0709 3005.9917 3026.4433 3033.8111 3058.9380 3061.1253 3069.1762 3072.1869 3103.0022 3154.8346 3172.4797 3189.3895 3217.3690
redmass: 4.7482 7.7946 5.1262 1.8262 3.3557 2.0187 6.0088 4.3409 2.3901 3.4533 2.1209 4.8061 1.5053 4.8998 1.7817 1.1275 5.9359 7.0282 4.1290 5.2719 3.5663 6.3703 4.4931 6.5216 3.1751 3.0618 6.7447 5.7920 2.7739 4.1259 5.0511 4.5509 7.4967 3.8136 5.8905 6.7996 1.0767 1.1284 3.5376 7.9409 5.8889 1.2607 1.4247 6.9430 1.2949 1.3964 1.5346 1.9535 3.5812 1.3075 1.2131 1.8357 3.5681 4.0172 1.5810 4.3468 2.3541 3.0356 2.4574 2.1023 1.4351 2.8931 2.9542 1.7253 1.6323 3.5031 1.3325 1.3136 1.7091 1.3802 1.1040 1.3849 1.0981 1.0922 1.4813 1.6200 1.6842 2.7744 3.0650 1.2177 1.5200 4.4623 1.0914 1.0686 1.0759 1.0454 1.1006 1.0697 1.0427 1.0802 1.0919 3.4011 7.8723 7.1873 7.4228 10.2458 10.4140 1.0591 1.0590 1.0593 1.0363 1.0381 1.0612 1.0979 1.0595 1.1013 1.0999 1.1029 1.0969 1.1033 1.1008 1.0993 1.0985 1.0906 1.0920 1.0931 1.0945
irintensity: 0.1803 3.0060 0.9679 0.8098 0.9004 1.3954 0.3141 2.0172 0.0784 0.1150 0.5258 0.0445 0.0074 2.7236 1.6741 0.0025 5.8825 0.3247 0.5218 5.9243 3.1132 0.7641 9.3001 0.4728 1.0504 5.8766 7.6959 10.2494 0.6452 0.7199 4.3888 2.0952 2.1048 6.3154 15.4506 9.2971 15.4805 0.0765 1.0845 3.1132 57.9156 5.8385 21.0445 11.8109 0.0444 32.1986 54.8595 1.7513 100.8196 1.1916 1.5343 45.1468 17.1859 194.2974 8.1847 67.3298 64.1900 494.2367 107.6349 194.6060 0.5770 46.2916 15.3673 78.6964 0.2525 33.4669 55.1716 0.1171 54.3378 3.8439 0.0407 35.5625 0.2910 0.6225 23.1917 9.8906 11.6964 164.4146 4.6608 10.8201 49.2412 22.6410 19.3033 0.1587 0.6178 17.3251 11.0462 3.9696 12.6602 1.8168 23.8069 19.5341 74.0626 93.0973 247.4109 164.4722 518.0705 3.8694 9.2256 85.8593 39.0483 11.0716 8.9038 1.3368 39.4720 1.2642 10.1437 31.5105 11.5542 47.7766 108.5686 53.4556 21.2182 6.9329 1.7886 1.0741 6.0183
temp: 298.150 k
press: 1.00000 atm
elementType: 8 8 8 8 6 6 6 6 6 6 6 6 6 6 6 6 6 6 6 6 6 1 1 1 1 1 1 1 1 1 1 1 1 1 1 1 1 1 1 1 1
symmnumber: 1
zpe: 869297.4 jmol-1
zpe.correction: 0.331098 hartree
zpe.thermalcorrener: 0.352512 hartree
zpe.thermalcorrenthalpy: 0.353456 hartree
zpe.thermalcorrgfe: 0.278002 hartree
zpe.sumelectzpe: -959.165565 hartree
zpe.sumelectthermal: -959.144151 hartree
zpe.sumelectthermalent: -959.143206 hartree
zpe.sumelectthermalfe: -959.218661 hartree
dipole: -3.0389 3.9386 0.0486
dipole: 4.9749
quadrupole: -127.3836 -133.2579 -124.7564
quadrupole: 37.4579 0.2432 0.2588
quadrupole: 1.0824 -4.7919 3.7096 37.4579 0.2432 0.2588
hfenergy: -959.496663 hartree
pointgroup: C01 [X(C17H20O4)]
dipole: 1.1627966 -1.1837927 1.0380095 debye
polarizability: 338.5328317|-13.4660785|164.0957036|21.9381525|-44.9291659|146.5766956 unknown
InChI: InChI=1S/C17H20O4/c1-3-4-5-6-7-16(18)20-13-8-9-14-12(2)10-17(19)21-15(14)11-13/h8-11H,3-7H2,1-2H3
charge 0 multiplicity 1
41 atoms
O  0.676629 0.222258 -0.315567
O  -3.837804 1.237826 -1.33474
O  1.77039 -1.388089 1.02043
O  -5.98206 1.851726 -1.926036
C  5.611474 0.476482 -0.196154
C  6.936144 -0.103319 0.348724
C  4.368239 -0.291093 0.304912
C  8.18487 0.666267 -0.139103
C  3.059794 0.302487 -0.251076
C  9.504395 0.081013 0.408849
C  1.818454 -0.412232 0.248027
C  -3.456126 -0.649125 0.213197
C  -2.972002 0.404478 -0.621937
C  -0.675844 -0.148263 -0.076867
C  -4.899955 -0.849241 0.317185
C  -1.597163 0.659216 -0.770715
C  -2.4889 -1.439394 0.893784
C  -1.109074 -1.210526 0.765354
C  -5.74445 -0.01746 -0.393672
C  -5.453377 -1.951436 1.192372
C  -5.285634 1.066146 -1.256595
H  5.636183 0.461868 -1.306108
H  5.532185 1.54389 0.099556
H  6.912272 -0.094367 1.458443
H  7.022976 -1.168575 0.04884
H  4.338176 -0.275035 1.411354
H  4.442391 -1.357172 0.015987
H  8.097696 1.730333 0.162158
H  8.208158 0.658273 -1.248122
H  2.964082 1.373826 0.015262
H  3.047453 0.274294 -1.358677
H  9.519041 0.103539 1.514937
H  9.632142 -0.971956 0.093978
H  10.380756 0.649988 0.047773
H  -1.253543 1.471798 -1.414503
H  -2.824246 -2.255736 1.541127
H  -0.384435 -1.827693 1.295004
H  -6.830403 -0.134973 -0.341722
H  -6.554339 -1.9706 1.158488
H  -5.144518 -1.817003 2.246086
H  -5.082528 -2.942118 0.868668
