program: Gaussian 09
title: 000087480
version: EM64L-G09RevD.01
frameworkgroup: C1[X(C6H12Cl2Si2)]
method: RPBEPBE
basis: SDD
operation: Freq
keyword: #p
keyword: freq=noraman
keyword: PBEPBE/SDD
title: #p freq=noraman PBEPBE/SDD
converged: YES YES NO NO
title: Mulliken charges:
elementType: Cl Cl Si Si C C C C C C H H H H H H H H H H H H
charge: -0.304691 -0.304692 1.008582 1.008581 -0.990177 -0.987248 -0.990176 -0.987248 -0.278251 -0.278257 0.260706 0.246521 0.266682 0.270086 0.248364 0.259428 0.266681 0.260709 0.246520 0.270088 0.248364 0.259427
chargesum: 0.00000
title: Mulliken charges with hydrogens summed into heavy atoms:
elementType: Cl Cl Si Si C C C C C C
charge: -0.304691 -0.304692 1.008582 1.008581 -0.216268 -0.209369 -0.216266 -0.209369 -0.278251 -0.278257
polarizability: 1.69524591e+02 -9.28196118e-02 1.21060905e+02 4.90848369e-04 -5.98219572e-07 1.10552639e+02
1716.lowfreq: 0.0033 0.0036 0.0038 5.0279 5.7241 10.9638 12.7742 38.1191 43.5395
frequency: 12.5177 38.0807 43.5358 91.5411 108.6696 145.9159 145.9273 147.0022 159.7425 160.5365 167.8558 172.1536 180.3825 187.8591 217.5398 274.2266 293.9453 349.4875 402.9371 405.7489 423.7600 455.9734 637.3226 666.7546 730.1781 730.4681 777.9670 826.7323 826.8554 843.0891 845.1537 898.4409 902.3927 921.9882 928.2339 1310.8188 1311.1710 1319.2592 1319.7112 1431.6093 1431.8332 1440.0695 1440.1123 1440.6411 1441.1008 1451.8715 1452.1827 2134.3650 2994.2495 2994.2837 2995.2930 2995.3068 3098.3045 3098.3528 3099.9452 3099.9635 3113.1553 3113.2679 3114.3296 3114.3682
redmass: 4.9087 6.3508 4.2855 7.8816 3.3321 1.0318 1.0309 2.0723 1.0509 1.3658 2.6712 3.3305 3.4825 2.8127 3.0498 7.9477 5.9009 6.9944 8.0283 8.6905 9.2272 8.1962 4.7549 4.5220 2.6348 2.6220 6.5668 1.3030 1.3008 1.5902 1.5930 1.4572 1.4185 1.4396 1.4364 1.1955 1.1951 1.1852 1.1857 1.0504 1.0503 1.0478 1.0479 1.0515 1.0513 1.0471 1.0470 12.0275 1.0346 1.0346 1.0344 1.0344 1.0984 1.0983 1.0981 1.0982 1.0991 1.0991 1.0991 1.0990
irintensity: 2.8089 3.6588 0.2267 0.0181 0.7478 0.0328 0.0201 0.0070 0.1566 0.5915 2.1272 1.5536 1.9678 0.4371 18.1205 17.2804 28.6934 10.4375 22.7231 0.1368 73.8142 11.5522 33.7516 4.8143 3.2913 17.6740 207.0844 2.5708 12.7046 18.0823 103.2373 391.2929 30.8748 286.9150 5.2623 12.1850 70.8750 31.8104 2.6075 1.2694 6.9764 10.3836 0.0079 4.6485 2.9955 25.1271 2.9676 0.1381 0.7453 6.0504 10.0718 0.4328 2.9611 0.1824 3.3019 23.3376 9.6081 1.9699 8.6587 3.2838
temp: 298.150 k
press: 1.00000 atm
elementType: 17 17 14 14 6 6 6 6 6 6 1 1 1 1 1 1 1 1 1 1 1 1
symmnumber: 1
zpe: 423935.5 jmol-1
zpe.correction: 0.161469 hartree
zpe.thermalcorrener: 0.178048 hartree
zpe.thermalcorrenthalpy: 0.178992 hartree
zpe.thermalcorrgfe: 0.114850 hartree
zpe.sumelectzpe: -1734.025254 hartree
zpe.sumelectthermal: -1734.008675 hartree
zpe.sumelectthermalent: -1734.007731 hartree
zpe.sumelectthermalfe: -1734.071873 hartree
dipole: 0.0000 0.0001 2.4425
dipole: 2.4425
quadrupole: -93.0067 -91.6657 -87.8695
quadrupole: 19.4605 0.0004 -0.0001
quadrupole: -2.1594 -0.8184 2.9778 19.4605 0.0004 -0.0001
hfenergy: -1734.1867224 hartree
pointgroup: C01 [X(C6H12Cl2Si2)]
dipole: 0.0000655 0.9609674 0.0007398 debye
dipolederiv: -0.5322807 -0.0316605 -0.093585 -0.0769493 -0.4487381 -0.1310295 -0.1834811 -0.126891 -0.7001279 -0.5322754 0.0318273 -0.093517 0.0772696 -0.4491824 0.131459 -0.183338 0.127331 -0.6996976 2.2236171 0.0161564 0.1539968 0.0541431 1.35211 0.105842 0.1783817 0.1046949 1.5470631 2.2236077 -0.0165272 0.1539553 -0.0545623 1.3524661 -0.1061879 0.178238 -0.1050377 1.5467056 -0.4665607 0.0149192 -0.0023637 0.0147873 -0.4202152 0.010571 0.0044037 -0.0026591 -0.3270943 -0.4702201 0.0011794 0.0023672 0.0019773 -0.3747983 0.0351563 0.0059487 0.0483785 -0.3712833 -0.4665738 -0.0149199 -0.0023858 -0.0147843 -0.42019 -0.0107255 0.0043696 0.0024983 -0.3271031 -0.4702156 -0.0011736 0.0023488 -0.0019859 -0.3746597 -0.0351629 0.0059414 -0.0483777 -0.3714191 -0.9695992 0.0294066 -0.0448156 0.0472856 -0.39812 0.0264154 0.01458 0.022674 -0.3615752 -0.9695989 -0.0292504 -0.044868 -0.047235 -0.3980286 -0.0264699 0.0145045 -0.0227362 -0.3616607 -0.1236834 0.0057512 -0.0170912 0.0858918 0.1064724 0.0011531 -0.0148663 -0.001799 0.1143781 0.1185428 -0.0036854 -0.0196127 -0.0324077 0.0319474 -0.1215023 -0.0363536 -0.0786703 -0.0407028 0.1120795 -0.0322714 0.0391703 -0.0707598 0.0141615 0.1024126 0.0442494 0.0785449 0.0195384 0.1125631 0.0462138 0.0042291 0.0798622 -0.068401 -0.0043168 -0.0223702 0.0221131 0.1071546 0.1183393 -0.0129081 -0.0129986 -0.003619 0.0931068 -0.0195537 -0.0458654 -0.0637792 -0.0977243 -0.1227979 -0.0144818 -0.0092769 -0.0726893 0.1124605 0.0014676 0.0554097 0.0043623 0.1103881 0.1120923 0.0321977 0.0392101 0.070687 0.0144352 -0.1024216 0.0443612 -0.0785587 0.0192548 -0.1236883 -0.0056801 -0.0171242 -0.0858227 0.1064854 -0.0011663 -0.0150237 0.0017881 0.1143763 0.1185563 0.0036961 -0.0195703 0.0324304 0.0316151 0.1216267 -0.0362648 0.0787956 -0.0403872 0.112546 -0.0462413 0.0041578 -0.0798398 -0.0683558 0.0040388 -0.0224995 -0.0223933 0.1071238 0.1183362 0.0129304 -0.012991 0.0036922 0.0929707 0.0198612 -0.0458726 0.0640897 -0.0975858 -0.1227863 0.0145215 -0.0092354 0.0726286 0.1124579 -0.0014674 0.0555475 -0.0043684 0.1103783 unknown
polarizability: 167.3825119|-0.0120124|110.5526492|9.9615767|-0.0109619|123.2029743 unknown
InChI: InChI=1S/C6H12Cl2Si2/c1-9(2,7)5-6-10(3,4)8/h1-4H3
charge 0 multiplicity 1
22 atoms
Cl -3.01071 -0.508752 -2.091696
Cl 3.013404 -0.512664 2.09223
Si -2.474741 0.343399 -0.107103
Si 2.477544 0.342852 0.10905
C  -3.178378 2.100681 -0.072615
C  -3.182388 -0.832781 1.195883
C  3.181498 2.100064 0.077469
C  3.184953 -0.831303 -1.195895
C  -0.621366 0.365865 -0.031815
C  0.624171 0.365736 0.033885
H  -4.275677 2.077404 -0.190584
H  -2.937439 2.594326 0.886702
H  -2.75495 2.705825 -0.891953
H  -2.754175 -1.842498 1.079248
H  -2.945037 -0.470593 2.212938
H  -4.279103 -0.9060 1.093933
H  2.758089 2.703963 0.897736
H  4.278779 2.076391 0.195526
H  2.94076 2.595301 -0.881078
H  2.756646 -1.841165 -1.080853
H  2.947551 -0.467454 -2.212346
H  4.281669 -0.904797 -1.094163
