program: Gaussian 09
title: 000087475
version: EM64L-G09RevD.01
frameworkgroup: C1[X(C4H7Cl3O2Si)]
method: RPBEPBE
basis: SDD
operation: Freq
keyword: #p
keyword: freq=noraman
keyword: PBEPBE/SDD
title: #p freq=noraman PBEPBE/SDD
converged: NO YES NO NO
title: Mulliken charges:
elementType: Cl Cl Cl Si O O C C C C H H H H H H H
charge: -0.231477 -0.237484 -0.237933 0.825163 -0.258869 -0.233824 -0.811555 -0.428280 0.253183 -0.502799 0.299462 0.302048 0.266478 0.266647 0.245201 0.245042 0.238994
chargesum: 0.00000
title: Mulliken charges with hydrogens summed into heavy atoms:
elementType: Cl Cl Cl Si O O C C C C
charge: -0.231477 -0.237484 -0.237933 0.825163 -0.258869 -0.233824 -0.210044 0.104845 0.253183 0.226438
polarizability: 1.16541537e+02 8.04452558e+00 9.62178613e+01 -3.22478054e-01 -1.14261365e-01 8.66460152e+01
1716.lowfreq: -14.4902 -8.3946 -7.0978 -0.0029 -0.0016 0.0014 5.8824 32.0742 54.7798
frequency: -12.1396 32.0282 54.7364 55.6548 75.1877 125.7345 132.0223 137.1551 165.1595 177.2981 200.5399 255.5882 281.9410 389.8968 426.5874 495.1274 525.2534 550.5877 650.6310 752.5224 758.5330 852.2360 944.9104 954.6632 1060.4628 1114.1456 1143.4638 1148.5274 1149.0557 1246.7478 1277.9970 1348.9694 1407.9259 1423.7349 1448.1682 1454.4554 1462.5726 1648.5599 3004.2044 3009.9781 3021.5741 3056.7650 3086.4730 3113.3425 3157.8939
redmass: 6.0014 6.8461 5.2574 3.0270 1.1198 10.2635 6.3065 10.0274 3.5310 10.8385 3.8093 17.1739 4.4054 10.5832 5.4965 12.8426 21.1924 2.6973 5.7485 1.4598 5.1713 5.1407 6.8114 1.7049 3.9424 1.2647 1.2521 2.4018 1.6557 1.3598 1.1131 1.5951 1.0886 1.1909 1.0850 1.0495 1.0505 8.8603 1.0604 1.0302 1.0585 1.1001 1.1012 1.1050 1.1048
irintensity: 1.8544 0.2270 0.9513 0.3472 0.4368 1.0570 0.0604 3.3529 15.9662 10.4128 0.0455 10.6297 21.5816 49.3469 15.2294 96.4084 126.9332 1.4893 9.5593 60.2366 43.7964 0.5474 7.1708 9.2467 58.4196 0.0435 26.3846 167.0250 82.9285 101.3070 0.0084 50.9455 9.4692 27.6162 32.1388 15.4196 13.1603 157.8884 11.5193 26.3185 5.8133 1.8810 0.3610 24.0847 13.5289
temp: 298.150 k
press: 1.00000 atm
elementType: 17 17 17 14 8 8 6 6 6 6 1 1 1 1 1 1 1
symmnumber: 1
zpe: 291763.3 jmol-1
zpe.correction: 0.111127 hartree
zpe.thermalcorrener: 0.123872 hartree
zpe.thermalcorrenthalpy: 0.124816 hartree
zpe.thermalcorrgfe: 0.068789 hartree
zpe.sumelectzpe: -1975.963462 hartree
zpe.sumelectthermal: -1975.950717 hartree
zpe.sumelectthermalent: -1975.949773 hartree
zpe.sumelectthermalfe: -1976.005800 hartree
dipole: -3.9778 -0.4786 -0.0396
dipole: 4.0067
quadrupole: -81.3714 -95.5232 -89.5951
quadrupole: 4.8670 -0.0378 0.0108
quadrupole: 7.4584 -6.6933 -0.7652 4.8670 -0.0378 0.0108
hfenergy: -1976.074589 hartree
pointgroup: C01 [X(C4H7Cl3O2Si1)]
dipole: -1.5625473 0.2076007 0.015978 debye
dipolederiv: -0.6278891 0.2249873 -0.0117757 0.2902004 -0.6086039 0.0156006 -0.0158186 0.0158787 -0.3080731 -0.4129776 -0.0288759 0.0339354 -0.0753846 -0.4452899 0.2135132 0.0960779 0.217305 -0.6690512 -0.4132828 -0.0304177 -0.0294855 -0.0827281 -0.4897673 -0.2308695 -0.0870688 -0.2350225 -0.6255543 1.6565667 -0.1693177 0.0075299 -0.1662063 1.7138662 0.0024354 0.0072532 0.0031457 1.7960927 -1.4472857 0.321926 0.0028278 0.4752768 -0.6742805 -0.0030815 0.0042927 -0.0019973 -0.2911397 -0.7083364 -0.152237 -0.0005403 0.2109338 -0.8945692 -0.0013047 0.0032324 -0.0030965 -0.29119 -0.2373121 0.069456 -0.0022061 0.1505073 -0.3154555 0.0009299 -0.0087253 -0.0022292 -0.3108863 -0.356761 -0.0553433 0.0018879 -0.4801473 -0.0569249 0.0017348 0.0244469 0.0038941 0.1114142 1.5942695 -0.1226295 -0.0070126 -0.5031637 1.2787709 0.0048851 -0.0171477 0.0043078 0.1977931 0.6645646 -0.0587836 -0.0003151 0.0681371 0.2074158 0.0000715 0.0011496 0.0001827 0.2735779 0.0651847 -0.0369697 0.0648805 0.0358501 0.0562859 0.0702055 -0.0254122 0.0508192 0.0275032 0.0724478 -0.0432125 -0.0608943 0.0404181 0.0481333 -0.0702774 0.0244746 -0.0492283 0.0413965 0.0897726 -0.0068925 0.0117681 0.0441152 0.0615857 0.0618927 -0.0114881 0.0786294 0.0088846 0.0915254 -0.005342 -0.0109911 0.0468016 0.0509352 -0.0658152 0.0057005 -0.0822882 0.0196674 -0.0099999 0.0120321 -0.0065413 -0.0862393 0.0524703 0.1000727 0.0449881 0.0810012 -0.0496203 -0.0106361 0.0115511 0.0060335 -0.0853423 0.0562898 -0.0976642 -0.0472895 -0.0790901 -0.0540397 -0.0098505 0.0700688 0.0008991 0.1169713 -0.0408621 -0.0023289 0.0013343 -0.0022116 0.1232249 unknown
polarizability: 116.3359255|-8.3009385|96.4238488|0.2404044|0.0296449|86.6456387 unknown
InChI: InChI=1S/C4H7Cl3O2Si/c1-9-4(8)2-3-10(5,6)7/h2-3H2,1H3
charge 0 multiplicity 1
17 atoms
Cl 3.758839 -1.623187 0.094872
Cl 2.652624 1.143972 -1.812556
Cl 2.640965 1.31752 1.712841
Si 2.312978 -0.003104 0.009724
O  -2.895025 0.788016 0.007245
O  -2.193046 -1.435272 -0.006389
C  0.555097 -0.684408 0.038495
C  -0.534438 0.406459 -0.007762
C  -1.927658 -0.212913 0.000224
C  -4.306079 0.322152 0.005361
H  0.448063 -1.299102 0.950882
H  0.447104 -1.375616 -0.817235
H  -0.445625 1.034267 -0.91492
H  -0.460037 1.097042 0.853246
H  -4.503595 -0.293497 0.898374
H  -4.508038 -0.272678 -0.900691
H  -4.903528 1.243449 0.017391
