program: Gaussian 09
title: 000008065
version: EM64L-G09RevD.01
frameworkgroup: C1[X(C4H8O2)]
method: RPBEPBE
basis: SDD
operation: Freq
keyword: #p
keyword: freq=noraman
keyword: PBEPBE/SDD
title: #p freq=noraman PBEPBE/SDD
converged: YES YES NO NO
title: Mulliken charges:
elementType: O O C C C C H H H H H H H H
charge: -0.438964 -0.433732 -0.196030 -0.165568 -0.364140 -0.382582 0.249158 0.223148 0.226821 0.190572 0.224280 0.196054 0.335856 0.335127
chargesum: 0.00000
title: Mulliken charges with hydrogens summed into heavy atoms:
elementType: O O C C C C
charge: -0.103108 -0.098605 0.053128 0.057580 0.053253 0.037752
polarizability: 7.37075748e+01 9.57690010e-01 4.22850704e+01 -6.61497559e+00 -2.38993340e+00 4.29813669e+01
1716.lowfreq: -6.7590 -4.5566 -0.0009 -0.0007 0.0004 19.0461 55.7834 115.7578 130.2104
frequency: 55.0436 115.6974 130.1692 223.5913 290.3882 333.7551 374.8772 459.7369 521.8746 788.5685 913.2552 933.6863 943.7589 964.5846 994.4982 1071.9039 1095.7097 1140.4700 1193.3018 1274.9668 1282.8365 1302.8834 1325.2384 1368.9515 1378.2569 1463.9315 1464.7310 1677.9428 2951.7290 2964.8415 3062.5173 3066.8340 3093.0484 3108.7836 3554.2529 3557.7545
redmass: 3.6688 4.6672 3.1288 1.3560 1.5260 2.2262 1.3355 2.7987 4.7094 1.5144 3.7267 1.9960 4.0210 1.7915 1.1224 1.9668 2.6917 1.1027 1.4406 1.2493 1.2640 1.1789 1.2494 1.1928 1.2230 1.0921 1.0902 6.3422 1.0690 1.0669 1.0951 1.0897 1.0954 1.0906 1.0663 1.0664
irintensity: 1.4236 3.6556 3.7074 107.0170 108.7776 11.1657 122.8049 5.1622 20.7307 1.0104 176.5596 8.8227 20.9515 2.6550 76.5178 7.4113 51.3935 2.2583 34.4237 2.7500 4.4460 1.9425 16.0007 6.0659 45.6506 10.5116 2.2271 0.3629 73.0441 60.7240 20.1308 7.9846 24.2691 29.1937 5.1686 9.0110
temp: 298.150 k
press: 1.00000 atm
elementType: 8 8 6 6 6 6 1 1 1 1 1 1 1 1
symmnumber: 1
zpe: 301724.3 jmol-1
zpe.correction: 0.114921 hartree
zpe.thermalcorrener: 0.122570 hartree
zpe.thermalcorrenthalpy: 0.123514 hartree
zpe.thermalcorrgfe: 0.082893 hartree
zpe.sumelectzpe: -307.122796 hartree
zpe.sumelectthermal: -307.115146 hartree
zpe.sumelectthermalent: -307.114202 hartree
zpe.sumelectthermalfe: -307.154824 hartree
dipole: -0.6798 0.0659 2.6197
dipole: 2.7072
quadrupole: -50.6865 -33.4072 -34.7191
quadrupole: 0.6076 -3.3373 -1.1371
quadrupole: -11.0822 6.1971 4.8851 0.6076 -3.3373 -1.1371
hfenergy: -307.2377166 hartree
pointgroup: C01 [X(C4H8O2)]
dipole: 0.2663904 -0.2236324 1.0067127 debye
dipolederiv: -0.7958028 -0.1664773 0.1251468 -0.2183574 -0.4743053 -0.1576733 0.2221426 -0.1601873 -0.4009335 -0.9461888 -0.0383833 -0.0637212 -0.1057621 -0.6056181 0.1232435 0.0100565 0.0826701 -0.1277091 -0.1146379 -0.1218235 0.0423404 -0.0970188 -0.2099604 0.0770995 0.0861726 0.1015357 0.0701849 -0.1281818 -0.0894585 0.0394876 -0.0259287 -0.2371495 0.1740917 0.0269627 0.1638457 0.0556431 0.5602845 0.1861107 0.0140817 0.1686352 0.5064038 0.0284433 -0.1600791 0.0258085 0.3172733 0.6533684 0.1260646 0.049031 0.0934021 0.5467495 -0.1069866 -0.053394 -0.0521732 0.2357833 0.0727464 0.0456837 0.0158017 0.0797509 0.0928477 -0.1057709 0.0101914 -0.0980483 -0.0548551 0.0571737 0.036056 0.002221 0.0723215 0.0894562 -0.1211339 -0.0046247 -0.1191368 -0.0845585 -0.0386262 0.0518124 -0.0510694 0.0208517 -0.0325267 0.0775933 -0.0223567 0.1226031 0.0150818 0.0030237 -0.0771685 -0.0536065 -0.0263836 -0.0173387 -0.0834843 0.0030707 -0.1496981 -0.1545383 0.0495363 -0.0441193 -0.0292746 -0.0136724 0.0286443 -0.0593996 0.0070394 -0.1149986 -0.0756085 -0.0868352 0.0373708 -0.0484888 0.0201488 -0.1026948 0.1115083 -0.0306745 0.1771382 -0.0472291 0.3047452 0.0912721 -0.1132801 0.0642888 0.1428758 0.1396015 -0.1329165 0.147078 0.2291311 0.4093945 -0.0369398 0.0713306 -0.032276 0.2726162 -0.0971324 0.0384095 -0.1264371 0.0223348 unknown
polarizability: 73.7004792|-0.428833|41.4146648|6.6930105|2.0626916|43.8588681 unknown
InChI: InChI=1S/C4H8O2/c5-3-1-2-4-6/h1-2,5-6H,3-4H2
charge 0 multiplicity 1
14 atoms
O  -2.986271 -0.34579 0.001049
O  2.947344 0.382215 -0.151243
C  -0.557644 0.001486 -0.35039
C  0.558345 -0.01847 0.425422
C  -1.869482 0.622145 0.066813
C  1.879605 -0.630159 0.020319
H  -0.545125 -0.469559 -1.344024
H  0.527083 0.455709 1.420731
H  -2.174464 1.414651 -0.638323
H  -1.785267 1.067016 1.080872
H  1.801582 -1.114329 -0.966129
H  2.19982 -1.391448 0.764576
H  -2.739106 -1.14492 0.532882
H  3.076879 0.862054 0.706443
