program: Gaussian 09
title: 000087472
version: EM64L-G09RevD.01
frameworkgroup: C1[X(C5H12Cl2O2Si)]
method: RPBEPBE
basis: SDD
operation: Freq
keyword: #p
keyword: freq=noraman
keyword: PBEPBE/SDD
title: #p freq=noraman PBEPBE/SDD
converged: YES YES NO NO
title: Mulliken charges:
elementType: Cl Cl Si O O C C C C C H H H H H H H H H H H H
charge: -0.078145 -0.080485 1.236322 -0.589415 -0.597297 -1.053822 -0.192295 -0.193001 -0.540134 -0.538799 -0.097278 0.261566 0.259881 0.246288 0.209378 0.242453 0.212339 0.242898 0.249531 0.275466 0.250207 0.274345
chargesum: 0.00000
title: Mulliken charges with hydrogens summed into heavy atoms:
elementType: Cl Cl Si O O C C C C C
charge: -0.078145 -0.080485 1.139044 -0.589415 -0.597297 -0.286088 0.259536 0.262235 -0.015137 -0.014247
polarizability: 9.88156272e+01 5.99606984e+00 9.91245850e+01 4.04725839e+00 -9.41758938e+00 9.83913408e+01
1716.lowfreq: -11.1783 -10.2395 -1.8886 -0.0012 0.0006 0.0014 29.6679 34.0961 44.0399
frequency: 29.3765 33.5395 44.0072 53.8437 92.3850 105.1640 125.4622 142.4778 154.9581 204.9587 250.4390 261.2631 303.0683 355.7782 418.9132 427.5838 587.4226 597.0455 610.2556 657.9429 687.6544 761.3782 784.7226 884.2651 887.6705 907.3037 916.1053 954.5407 958.1169 1020.6388 1023.7560 1100.9983 1110.2834 1174.5370 1175.2059 1227.4612 1229.5578 1296.4709 1298.0730 1322.3512 1375.6055 1377.4204 1425.8919 1426.4747 1439.8131 1446.7701 1464.6565 1471.2595 2147.7145 2938.7436 2941.2300 2996.4923 3016.8224 3018.8899 3059.0648 3059.6803 3100.9574 3105.3268 3146.5057 3146.9024
redmass: 13.9196 4.7972 6.3395 6.1492 3.8842 3.7681 3.8441 1.1789 3.3583 3.1549 3.0087 2.4263 3.4898 3.7156 3.1354 3.5287 5.1104 5.2139 3.5789 3.3471 1.6464 1.4143 1.5989 1.6541 1.7788 1.6609 1.3273 2.1300 2.0297 1.9517 1.9192 4.1125 4.5564 1.1861 1.1826 1.1568 1.1626 1.1760 1.1834 1.2018 1.2727 1.2703 1.1072 1.1070 1.0494 1.0479 1.0759 1.0738 1.0426 1.0609 1.0609 1.0348 1.1004 1.1006 1.0580 1.0581 1.0978 1.0988 1.1102 1.1103
irintensity: 1.0207 2.0779 4.0752 5.5910 1.8770 1.4665 3.1956 2.3811 11.3867 9.3574 3.6461 7.0694 7.6942 34.9468 2.0179 5.8702 26.8568 31.6011 0.9958 23.7822 7.2475 65.3201 93.2597 7.1520 4.4397 209.8026 122.9021 24.8249 90.7104 52.4886 86.7637 111.9274 168.7624 0.5545 2.5466 0.9301 1.9935 9.8416 28.8296 53.8707 12.7370 8.9784 9.5601 13.2658 8.8447 8.7416 11.6049 4.0863 143.4580 72.9895 39.6319 5.1804 2.0676 5.0636 40.1510 14.6054 9.3282 9.8522 9.3835 11.0518
temp: 298.150 k
press: 1.00000 atm
elementType: 17 17 14 8 8 6 6 6 6 6 1 1 1 1 1 1 1 1 1 1 1 1
symmnumber: 1
zpe: 438330.9 jmol-1
zpe.correction: 0.166951 hartree
zpe.thermalcorrener: 0.180994 hartree
zpe.thermalcorrenthalpy: 0.181938 hartree
zpe.thermalcorrgfe: 0.123051 hartree
zpe.sumelectzpe: -1556.895549 hartree
zpe.sumelectthermal: -1556.881506 hartree
zpe.sumelectthermalent: -1556.880562 hartree
zpe.sumelectthermalfe: -1556.939449 hartree
dipole: -1.3452 -1.0032 0.2829
dipole: 1.7018
quadrupole: -82.9097 -79.5982 -78.7088
quadrupole: -2.0459 6.5379 -10.3307
quadrupole: -2.5042 0.8074 1.6968 -2.0459 6.5379 -10.3307
hfenergy: -1557.0625003 hartree
pointgroup: C01[X(C5H12Cl2O2Si1)]
dipole: 0.0207852 0.6669948 0.0544946 debye
dipolederiv: -0.2885886 0.0738149 0.09618 -0.0037673 -0.4145302 -0.1592705 0.0441975 -0.2014297 -0.317141 -0.2886469 -0.010022 0.1036428 0.0236092 -0.2229654 0.1037773 0.0186707 0.1435163 -0.5106541 1.9104592 -0.0507887 -0.2152374 0.011089 2.0271363 -0.0730423 -0.0641648 -0.073413 1.3522264 -0.9317956 -0.3035472 0.2167175 -0.3907607 -1.1714845 0.2854779 0.3463837 0.4152042 -0.7764202 -1.0177479 0.4282272 0.1117637 0.5265009 -1.3207793 -0.0674769 0.1213878 -0.1084265 -0.5470514 -0.316645 -0.0748419 -0.0166857 -0.0290352 -0.4823473 -0.082619 -0.0174265 -0.1020786 -0.3853694 0.3079018 0.1406936 -0.119481 0.1966936 0.5473237 -0.235538 -0.3815349 -0.5067431 0.4359487 0.3626811 -0.2272503 -0.0526681 -0.4051443 0.7874493 0.0653058 -0.2473646 0.2374314 0.174948 0.2071105 -0.1891887 -0.0998223 -0.1480357 0.4118433 0.2507937 -0.085446 0.2925665 0.3915147 0.1775356 0.1003993 -0.1530806 0.0785181 0.1741369 -0.1317029 -0.125026 -0.1657218 0.6401889 -0.2745285 0.0334797 -0.0247486 0.002144 -0.3229386 0.0079568 -0.0198914 0.0284039 -0.3262266 0.1085384 0.0202226 -0.0362994 0.0055617 0.1188755 0.0414422 -0.0418854 0.0587297 -0.0854767 -0.0060389 -0.1137067 0.0445602 -0.1203811 0.0140649 0.0449257 0.0276294 0.0185543 0.1135396 -0.0241538 0.1163751 0.012019 0.1242011 0.0213633 -0.0064179 0.0243912 -0.0250687 0.1124981 0.0018271 -0.028872 0.096221 0.0399821 -0.0679427 -0.1083483 0.1397391 0.0034752 -0.1039102 0.0132393 0.01115 -0.0748033 -0.0148885 0.0172452 0.0586981 0.008015 0.0875737 0.0136515 -0.0037028 0.0831624 0.0616653 0.0473934 -0.0214774 0.0595722 0.1382852 -0.0412727 -0.1536173 0.0136811 -0.043494 -0.0515272 0.023316 -0.0571387 -0.0317711 0.007354 -0.0439344 0.0812982 0.0607814 -0.0122912 0.062653 -0.0275516 -0.0384824 0.0311023 0.0956768 0.043004 -0.0806919 -0.0419173 0.0665761 -0.0232602 0.0992698 0.0281941 -0.0252643 -0.057057 -0.0563141 0.019665 0.0538339 0.0570783 0.0481866 0.085686 -0.0720919 -0.0338972 0.0663185 -0.0350722 -0.0329268 -0.0238242 -0.0771765 0.0140046 -0.1244006 0.044546 0.0062964 0.0017477 0.0310157 -0.0159933 unknown
polarizability: 95.2858628|-2.4914293|105.2485103|-9.9913803|1.9107215|95.7971799 unknown
InChI: InChI=1S/C5H12Cl2O2Si/c1-10(8-4-2-6)9-5-3-7/h10H,2-5H2,1H3
charge 0 multiplicity 1
22 atoms
Cl -1.812722 -2.393832 -0.689838
Cl 1.888185 -1.50811 1.481416
Si -0.193215 1.831989 -0.678411
O  -1.553194 0.827735 -0.298521
O  1.292777 0.950012 -0.546705
C  0.043397 3.288617 0.495955
C  -1.736813 -0.028233 0.865179
C  1.594239 -0.365937 -1.091467
C  -2.65695 -1.1796 0.489735
C  2.622945 -1.043213 -0.199428
H  -0.497967 2.224756 -2.095893
H  0.268417 2.936833 1.518006
H  0.889372 3.915861 0.163357
H  -0.862425 3.918911 0.531795
H  -2.23951 0.549464 1.672278
H  -0.771088 -0.408056 1.254073
H  2.050877 -0.2508 -2.099396
H  0.685054 -0.992086 -1.188329
H  -2.938732 -1.775771 1.371851
H  -3.544192 -0.820123 -0.051146
H  2.978609 -1.989128 -0.637023
H  3.460036 -0.367689 0.028714
