program: Gaussian 09
title: 000087501
version: EM64L-G09RevD.01
frameworkgroup: C1[X(C17H27NO2)]
method: RPBEPBE
basis: SDD
operation: Freq
keyword: #p
keyword: freq=noraman
keyword: PBEPBE/SDD
title: #p freq=noraman PBEPBE/SDD
converged: YES YES NO NO
title: Mulliken charges:
elementType: O O N C C C C C C C C C C C C C C C C C H H H H H H H H H H H H H H H H H H H H H H H H H H H
charge: -0.292024 -0.326076 -0.684665 -0.385262 -0.381024 -0.371424 -0.372727 -0.367682 -0.353204 -0.403835 -0.356675 -0.277292 -0.696589 0.243579 0.067016 0.325618 -0.317612 -0.396610 -0.267984 -0.195418 0.193026 0.195105 0.192120 0.191209 0.193933 0.187211 0.189562 0.190010 0.188603 0.218305 0.187664 0.187385 0.214444 0.194241 0.194975 0.194844 0.231775 0.223393 0.209543 0.209631 0.215008 0.263301 0.218040 0.228168 0.224009 0.374620 0.299761
chargesum: 0.00000
title: Mulliken charges with hydrogens summed into heavy atoms:
elementType: O O N C C C C C C C C C C C C C C C C C
charge: -0.292024 -0.326076 -0.010283 0.002870 0.002305 0.009720 0.006846 0.039226 0.021846 0.004850 0.033144 0.177876 -0.062408 0.243579 0.067016 0.325618 -0.054311 -0.178571 -0.039816 0.028592
polarizability: 2.54717782e+02 1.11859927e+01 2.16303840e+02 2.37322207e+01 -1.34483585e+01 1.42940795e+02
1716.lowfreq: -4.4440 -0.0009 -0.0004 0.0011 4.0063 6.8672 14.1876 15.5000 32.1259
frequency: 13.9407 15.2362 32.0362 40.3997 46.5577 71.4281 78.2569 85.2039 112.0885 118.8634 124.3023 135.5786 143.4478 155.8199 161.8855 207.3249 230.2739 232.6403 249.7474 272.2933 290.6102 341.6580 367.2854 409.0079 426.5268 437.7149 464.1500 465.6420 484.7524 513.5186 525.3197 555.2287 656.2084 677.8284 719.6294 723.3196 728.1553 732.4582 754.8270 758.1780 779.3520 784.0514 799.9118 838.2505 853.9767 866.3931 870.2962 889.1532 904.7419 958.8688 961.4091 982.0293 985.8692 1008.5023 1017.5192 1020.8331 1028.5328 1045.0113 1058.4789 1064.1440 1073.1071 1080.2873 1081.8878 1092.5833 1123.9534 1144.5725 1153.1557 1174.4636 1184.3811 1200.8190 1216.6173 1228.6023 1250.3805 1258.0178 1260.1685 1279.3819 1282.9228 1287.5327 1289.1356 1292.1740 1298.4123 1299.9743 1323.3194 1331.3288 1346.8900 1355.6423 1357.8106 1364.0565 1367.9981 1390.2804 1403.4341 1444.1898 1451.8424 1461.2129 1461.5909 1465.1815 1468.2344 1473.2042 1474.3892 1477.2395 1480.5681 1485.9165 1486.1413 1488.9443 1535.8816 1578.1991 1618.5358 1634.7489 2949.1366 2950.2467 2951.1311 2955.0693 2961.1856 2966.4787 2968.4599 2971.6189 2976.6295 2982.6762 2987.9839 2996.5073 3001.2416 3009.4028 3020.4780 3028.2317 3038.9204 3050.3547 3067.9928 3068.5980 3070.3646 3119.2415 3140.0796 3156.9481 3177.9546 3402.0894 3648.2499
redmass: 4.7614 4.7420 1.5454 3.8005 4.1608 2.5826 2.5179 2.7814 2.9728 4.1377 2.4470 2.8112 2.6914 2.6988 2.8772 3.0721 1.1263 2.7238 3.5904 3.5484 5.1277 3.4433 3.5643 5.7604 2.6181 3.4222 2.8279 1.2805 3.6180 2.9559 3.0987 6.4619 6.4209 4.4663 1.0597 1.0811 1.2803 1.1599 1.3030 1.6520 1.9979 3.4955 1.6945 2.0879 1.5152 2.5486 2.0355 1.8846 1.5362 1.3554 1.3635 1.3265 4.5035 2.1365 1.6727 2.1432 2.4674 2.9990 2.1375 2.5324 2.5119 2.3946 2.0688 2.0807 2.8130 1.7382 1.3050 1.0576 1.7428 1.2408 1.4214 1.2936 1.5125 2.1656 1.3132 1.0941 1.1351 1.8647 1.1149 1.2012 1.1255 1.1149 1.3600 1.9638 1.4643 1.6773 1.6021 1.5352 1.6614 1.2178 5.8886 3.0279 1.0817 1.0731 1.0727 1.0654 1.0796 1.0867 1.0802 1.0424 1.0840 1.3901 1.6929 1.0943 3.9399 7.0978 1.4697 7.1609 1.0587 1.0587 1.0591 1.0594 1.0595 1.0621 1.0588 1.0367 1.0617 1.0958 1.0970 1.0996 1.0598 1.1012 1.0991 1.1028 1.1043 1.1032 1.1007 1.1074 1.0993 1.0864 1.0916 1.0933 1.0980 1.0560 1.0946
irintensity: 0.0077 0.0322 0.0329 0.0377 0.4433 2.0276 0.5612 0.2879 0.8755 0.7674 0.0350 0.2966 0.1440 0.5543 0.8425 2.5247 0.0091 1.8305 0.6726 1.2863 8.1720 6.2130 2.6954 1.0960 28.4861 8.6044 2.7757 108.6215 5.7907 3.5052 23.1369 2.0766 7.4399 17.4217 16.1053 0.2033 94.6132 5.8598 1.2881 121.7328 4.4332 4.5191 0.4788 5.5898 2.0998 4.9970 0.3206 5.6918 3.1967 6.3226 1.8569 0.0122 0.6356 0.6620 0.6955 9.5268 0.6360 135.4923 1.1326 214.2019 23.8206 12.6559 2.3397 15.9531 9.5667 7.1162 13.4704 33.5905 0.3630 14.4455 11.7268 0.4508 121.7618 352.2227 31.7104 3.2686 3.9690 15.6770 0.8499 2.4101 1.1005 2.6650 1.6911 9.4671 0.5204 0.5743 2.7525 11.0950 1.4833 11.3231 8.0402 2.5014 5.7840 0.0087 0.2532 0.0326 0.2577 15.5383 0.6136 12.1878 1.8218 25.5125 17.2602 32.4934 253.4964 101.1184 118.0999 211.3721 2.2462 0.0171 3.0774 0.1674 32.7144 8.0810 181.4993 35.9053 58.1695 2.0857 2.9806 2.4484 26.4179 4.0792 2.8063 2.9165 92.4531 146.6339 91.9105 54.0344 54.4822 8.3942 23.0699 17.8044 12.4779 110.9915 56.8702
temp: 298.150 k
press: 1.00000 atm
elementType: 8 8 7 6 6 6 6 6 6 6 6 6 6 6 6 6 6 6 6 6 1 1 1 1 1 1 1 1 1 1 1 1 1 1 1 1 1 1 1 1 1 1 1 1 1 1 1
symmnumber: 1
zpe: 1071694.0 jmol-1
zpe.correction: 0.408187 hartree
zpe.thermalcorrener: 0.430681 hartree
zpe.thermalcorrenthalpy: 0.431625 hartree
zpe.thermalcorrgfe: 0.352427 hartree
zpe.sumelectzpe: -867.676274 hartree
zpe.sumelectthermal: -867.653781 hartree
zpe.sumelectthermalent: -867.652836 hartree
zpe.sumelectthermalfe: -867.732035 hartree
dipole: 0.1321 0.3420 0.0805
dipole: 0.3753
quadrupole: -109.2944 -117.2824 -124.5386
quadrupole: 8.5461 5.2578 -0.4798
quadrupole: 7.7441 -0.2440 -7.5001 8.5461 5.2578 -0.4798
hfenergy: -868.0844612 hartree
pointgroup: C01 [X(C17H27N1O2)]
dipole: -0.053269 0.1348302 -0.0280618 debye
polarizability: 255.2207689|-11.325562|215.4221391|22.5718284|15.4700435|143.3195088 unknown
InChI: InChI=1S/C17H27NO2/c1-2-3-4-5-6-7-8-11-14-20-17(19)15-12-9-10-13-16(15)18/h9-10,12-13H,2-8,11,14,18H2,1H3
charge 0 multiplicity 1
47 atoms
O  -2.003386 -1.186886 0.397505
O  -3.905822 -1.977981 -0.678096
N  -5.944943 -0.269865 -1.012309
C  3.338099 -0.575251 -0.252378
C  4.76436 -0.500377 0.337605
C  2.387643 -1.485918 0.557148
C  5.718489 0.401009 -0.478346
C  0.958401 -1.54565 -0.025885
C  7.14332 0.481093 0.114588
C  0.021414 -2.475701 0.776342
C  8.098648 1.379208 -0.704381
C  -1.402822 -2.542797 0.224268
C  9.519256 1.454669 -0.103954
C  -3.295302 -1.019578 -0.103195
C  -3.83363 0.334502 0.107218
C  -5.159947 0.661943 -0.364003
C  -3.061619 1.330903 0.771837
C  -5.648908 1.989412 -0.142329
C  -3.558849 2.625755 0.979738
C  -4.864472 2.946977 0.514559
H  3.393083 -0.942008 -1.298824
H  2.9087 0.447096 -0.304681
H  4.709942 -0.125408 1.381244
H  5.190534 -1.523923 0.397835
H  2.340537 -1.125117 1.606116
H  2.812592 -2.511173 0.600376
H  5.776338 0.023334 -1.520868
H  5.290594 1.42354 -0.542562
H  1.004738 -1.893363 -1.079294
H  0.52325 -0.527621 -0.050188
H  7.087328 0.862467 1.15589
H  7.571721 -0.541114 0.181684
H  -0.016756 -2.1507 1.834608
H  0.43043 -3.507227 0.774306
H  7.669541 2.399918 -0.7721
H  8.154978 0.996952 -1.744229
H  -2.032112 -3.270711 0.76847
H  -1.425002 -2.801386 -0.850797
H  9.9820 0.450772 -0.054134
H  9.493305 1.862172 0.92449
H  10.18167 2.102457 -0.707402
H  -2.062367 1.054643 1.119825
H  -6.654253 2.247995 -0.496546
H  -2.952579 3.378596 1.492577
H  -5.266468 3.954982 0.670227
H  -5.558369 -1.211549 -1.150596
H  -6.875206 -0.020593 -1.337559
