program: Gaussian 09
title: 000087464
version: EM64L-G09RevD.01
frameworkgroup: C1[X(C5H15O3PSi)]
method: RPBEPBE
basis: SDD
operation: Freq
keyword: #p
keyword: freq=noraman
keyword: PBEPBE/SDD
title: #p freq=noraman PBEPBE/SDD
converged: YES YES NO NO
title: Mulliken charges:
elementType: P Si O O O C C C C C H H H H H H H H H H H H H H H
charge: 0.937943 0.975083 -0.488194 -0.532794 -0.639673 -0.996496 -0.984171 -0.982181 -0.492825 -0.483916 0.245586 0.240413 0.280603 0.239635 0.258198 0.273704 0.245100 0.266568 0.251137 0.236705 0.244357 0.200380 0.228951 0.249979 0.225905
chargesum: 0.00000
title: Mulliken charges with hydrogens summed into heavy atoms:
elementType: P Si O O O C C C C C
charge: 0.937943 0.975083 -0.488194 -0.532794 -0.639673 -0.229893 -0.212633 -0.219376 0.188617 0.220920
polarizability: 1.27557556e+02 2.02705185e-01 1.15940767e+02 -2.79372080e-01 2.60769044e+00 1.06492997e+02
1716.lowfreq: -18.1436 -16.3381 -0.0011 -0.0010 0.0021 5.3729 22.4627 57.5404 62.4744
frequency: 21.8491 57.4521 62.2976 69.5628 80.0207 94.1897 107.3223 127.5410 142.3333 144.9523 153.5978 157.4382 166.7691 188.4374 192.6056 216.4486 225.2006 278.1648 323.4603 355.0989 466.2911 579.9241 608.4852 612.9059 712.0598 714.4261 762.0687 809.1980 812.1042 915.6432 920.3156 921.8852 960.6131 973.1950 1017.3950 1107.2860 1108.9160 1122.3366 1129.2783 1299.7674 1305.6187 1317.1759 1422.3899 1423.9882 1431.3118 1441.2672 1443.8953 1446.2759 1446.9486 1455.9494 1459.4252 1464.9175 1471.1265 1477.6355 2947.5588 2978.0227 2987.5046 2987.7197 2988.3773 3044.3276 3076.4038 3088.5484 3089.4644 3091.7411 3101.9373 3103.9116 3107.1518 3108.0173 3115.7482
redmass: 3.3619 2.3976 2.1977 1.2483 3.2601 3.7060 1.0696 1.0495 1.5679 1.2894 2.0159 3.0686 2.1069 3.3955 2.9114 3.6226 3.5596 5.2333 7.5399 5.6897 8.2729 5.5442 8.8941 7.5066 3.2255 3.2607 1.1699 1.3159 1.3223 1.4996 1.5311 1.4844 9.7906 8.0568 16.6152 1.2471 1.2464 1.3021 1.3076 1.1920 1.1891 1.1784 1.1184 1.1191 1.0534 1.0491 1.0518 1.0512 1.0502 1.0512 1.0477 1.0500 1.0539 1.0534 1.0358 1.0294 1.0349 1.0347 1.0345 1.0979 1.1048 1.0975 1.0978 1.0980 1.0986 1.0987 1.0997 1.0998 1.1034
irintensity: 0.8335 1.3549 3.0866 0.8416 0.8602 4.9782 0.2610 0.0825 4.0972 1.3957 4.8376 1.0857 2.4221 0.6359 15.4249 2.6238 7.5201 45.3476 4.3517 1.5936 17.0026 75.0773 84.4492 77.6780 7.3225 9.2950 0.0428 6.2294 4.6355 148.9362 166.6459 69.2729 171.1217 105.8202 74.9711 0.5211 1.0808 1.6109 0.3756 42.4774 43.2188 10.1637 1.7697 3.1692 0.1878 4.8889 6.6330 6.5421 10.6502 14.5321 21.9262 10.3121 9.8472 9.9908 62.4883 64.7650 7.3993 8.6169 11.0919 44.2971 29.5995 4.6131 10.9504 11.5872 6.4857 4.7356 19.5758 6.0406 18.4067
temp: 298.150 k
press: 1.00000 atm
elementType: 15 14 8 8 8 6 6 6 6 6 1 1 1 1 1 1 1 1 1 1 1 1 1 1 1
symmnumber: 1
zpe: 517643.3 jmol-1
zpe.correction: 0.197160 hartree
zpe.thermalcorrener: 0.214484 hartree
zpe.thermalcorrenthalpy: 0.215428 hartree
zpe.thermalcorrgfe: 0.150971 hartree
zpe.sumelectzpe: -1054.969768 hartree
zpe.sumelectthermal: -1054.952445 hartree
zpe.sumelectthermalent: -1054.951500 hartree
zpe.sumelectthermalfe: -1055.015957 hartree
dipole: 2.8542 1.2829 4.2029
dipole: 5.2399
quadrupole: -68.0961 -73.6549 -86.3632
quadrupole: -0.0762 -6.7810 -1.1080
quadrupole: 7.9420 2.3831 -10.3251 -0.0762 -6.7810 -1.1080
hfenergy: -1055.1669283 hartree
pointgroup: C01 [X(C5H15O3P1Si1)]
dipole: -1.082449 -0.9355183 1.4842705 debye
dipolederiv: 1.5237479 -0.1279802 0.1033584 -0.0837717 1.4195088 0.0435272 0.3194081 0.3171561 1.1054172 1.4613722 0.0004235 -0.0566663 -0.0224381 0.9551492 0.0251747 -0.0422436 0.0139274 1.0173751 -0.698027 0.2684398 0.0212248 0.1958531 -1.2767753 -0.0243346 0.0154076 0.0044324 -0.4800378 -1.3139279 -0.2561571 -0.3596113 -0.2897622 -0.6206439 -0.0959641 -0.4070661 -0.2038371 -0.7259465 -0.7557007 -0.0676562 0.1018911 0.0072818 -0.6490262 0.1041358 -0.0191422 0.0722605 -0.6279432 -0.431495 -0.0485101 0.0315082 -0.003728 -0.3226547 0.0352519 0.0324571 0.0550699 -0.4209618 -0.4166646 0.0982791 0.0155334 0.0166911 -0.3945026 -0.0015453 0.0122178 -0.0193167 -0.3266154 -0.4357147 -0.0441716 -0.0685905 -0.0315887 -0.3364469 -0.036185 -0.0186431 -0.0286732 -0.3679607 0.2739265 0.0521723 0.0265808 -0.0581636 0.5992505 -0.0433335 0.1210894 -0.349137 0.1908416 0.7043779 0.1633738 0.195619 0.2246586 0.3312284 0.1385013 -0.0498163 0.0229144 0.1721571 -0.0601811 0.0045376 0.1070775 -0.0347294 0.1041016 0.0247697 0.1717878 0.0160353 0.0145975 0.1059278 0.0547797 0.0011498 0.0461992 -0.1205872 -0.0140917 -0.02178 -0.0028312 0.1083637 0.0569725 -0.0272622 -0.0884395 -0.0117901 0.0996078 -0.0333512 -0.12008 -0.0555623 0.0307567 -0.119241 0.0348093 0.0527166 0.100037 0.0740469 -0.0239168 0.0611364 -0.0126916 0.1090798 0.0828112 -0.0471396 -0.066744 -0.064807 0.0474448 -0.090089 -0.0656265 -0.0746423 0.0002162 0.1277857 -0.0174619 0.0136424 -0.0181716 0.0469048 0.099528 0.0058035 0.0830714 -0.0009991 -0.1406137 -0.039166 0.0264829 -0.0681901 0.1074371 -0.0050272 -0.0311286 -0.0120002 0.1049641 0.1207379 -0.0009941 0.0002528 0.006674 0.0767315 0.0683955 0.0019638 0.0845738 -0.051066 0.1051981 0.0591136 0.0114639 0.0692307 -0.0837476 -0.0423859 0.030943 -0.0480873 0.0955208 0.0494814 -0.0216988 -0.0694126 -0.0239276 0.0501674 -0.0374426 -0.1084478 0.0781943 -0.0915327 0.0311985 0.103866 0.0626937 0.1105055 -0.0948426 -0.0570349 0.0496993 -0.0458226 0.0657776 -0.1594586 -0.1486402 0.0310928 -0.0620797 -0.0234749 0.0363588 0.0039955 0.0993194 0.0564345 0.0012501 -0.0411035 -0.0529874 -0.0453393 0.0944026 -0.0577749 -0.0790844 -0.0727261 -0.1169393 0.0420945 0.0123179 -0.0348616 -0.0585712 -0.059142 0.0471419 0.0556515 0.129119 0.0677393 -0.155858 0.0358287 -0.004975 0.0999271 -0.0241374 -0.0603081 0.0814976 -0.0507464 0.0707614 unknown
polarizability: 127.558767|0.1918006|116.6108511|-0.1920596|0.1984352|105.8217013 unknown
InChI: InChI=1S/C3H9Si.C2H6O3P/c1-4(2)3;1-4-6(3)5-2/h1-3H3;1-2H3
charge 0 multiplicity 1
25 atoms
P  0.611162 0.294097 -0.51934
Si -1.645475 0.058309 0.225585
O  1.231548 -1.220075 -1.193748
O  1.439159 0.411689 1.037564
O  0.954571 1.48398 -1.527615
C  -1.610143 -0.916028 1.86182
C  -2.194004 1.868727 0.433597
C  -2.53227 -0.839933 -1.200994
C  1.234217 -2.418083 -0.337896
C  2.761726 1.07454 1.066658
H  -2.588018 -0.846886 2.375039
H  -1.385289 -1.983859 1.693892
H  -0.833713 -0.502442 2.528252
H  -3.271866 1.926309 0.67498
H  -1.628725 2.356922 1.246657
H  -2.012137 2.437289 -0.495222
H  -3.609437 -0.95672 -0.977707
H  -2.435132 -0.270586 -2.142025
H  -2.105534 -1.844311 -1.369277
H  1.677489 -2.206841 0.653206
H  1.847197 -3.159935 -0.873098
H  0.210884 -2.826029 -0.203918
H  2.946034 1.315617 2.125049
H  2.748548 1.996546 0.457344
H  3.547907 0.395302 0.689197
