program: Gaussian 09
title: 000087439
version: EM64L-G09RevD.01
frameworkgroup: C1[X(C7H5F2NO)]
method: RPBEPBE
basis: SDD
operation: Freq
keyword: #p
keyword: freq=noraman
keyword: PBEPBE/SDD
title: #p freq=noraman PBEPBE/SDD
converged: NO NO NO NO
title: Mulliken charges:
elementType: F F O N C C C C C C C H H H H H
charge: -0.221224 -0.154198 -0.242125 -0.642460 -0.041394 0.295791 0.254397 -0.369837 -0.377427 -0.155462 0.181338 0.266262 0.267214 0.247497 0.352651 0.338977
chargesum: 0.00000
title: Mulliken charges with hydrogens summed into heavy atoms:
elementType: F F O N C C C C C C C
charge: -0.221224 -0.154198 -0.242125 0.049168 -0.041394 0.295791 0.254397 -0.103575 -0.110213 0.092035 0.181338
polarizability: 1.14351110e+02 -7.84816160e-01 9.86437028e+01 -1.97427830e-02 -8.69992374e-02 3.50399706e+01
1716.lowfreq: -45.5606 -8.0660 -0.0013 -0.0008 -0.0002 2.1939 11.8451 88.7197 225.1873
frequency: -45.4923 88.7131 225.1866 239.7331 254.8203 327.9714 353.6053 377.0778 466.4029 502.7300 522.9270 560.2826 567.3484 588.5859 599.5898 639.2731 679.2701 759.3506 769.3470 797.8136 877.5746 941.2322 966.7191 1049.2740 1077.7643 1120.5136 1165.3590 1206.5476 1225.6349 1338.3425 1373.6374 1429.6211 1446.9971 1563.7759 1593.9915 1621.8268 1632.2867 3162.1382 3182.7040 3193.2745 3515.4490 3673.9018
redmass: 7.1879 7.6548 4.7554 9.1881 7.0449 14.9153 6.0465 8.5133 3.2944 7.7514 5.2497 6.2978 2.2170 1.6474 1.3750 4.3991 2.5343 2.4841 5.9092 2.3097 1.3999 7.4767 1.3141 3.1055 2.0104 1.9895 1.1264 2.3158 3.8455 3.8312 10.6610 2.7266 3.2842 4.2615 1.9793 8.3478 2.7198 1.0881 1.0930 1.1000 1.0445 1.1054
irintensity: 8.3927 2.7471 0.0601 5.8267 0.9078 1.7825 13.0786 0.3460 0.0871 6.0183 13.9180 6.4549 45.2000 75.2260 149.1688 2.1338 68.5400 6.8353 3.1983 84.5271 0.2625 103.2264 1.2460 2.4248 1.2301 2.2135 0.2002 9.5990 10.8949 197.5567 12.9331 46.0472 38.6497 69.1733 123.0248 71.3187 320.4959 4.3075 1.0893 2.0079 42.4222 70.5806
temp: 298.150 k
press: 1.00000 atm
elementType: 9 9 8 7 6 6 6 6 6 6 6 1 1 1 1 1
symmnumber: 1
zpe: 285181.3 jmol-1
zpe.correction: 0.108620 hartree
zpe.thermalcorrener: 0.116997 hartree
zpe.thermalcorrenthalpy: 0.117941 hartree
zpe.thermalcorrgfe: 0.075224 hartree
zpe.sumelectzpe: -598.626363 hartree
zpe.sumelectthermal: -598.617986 hartree
zpe.sumelectthermalent: -598.617042 hartree
zpe.sumelectthermalfe: -598.659759 hartree
dipole: 3.0994 -3.6993 0.0387
dipole: 4.8262
quadrupole: -50.0086 -66.0883 -63.8759
quadrupole: 9.2312 -0.1064 -0.0192
quadrupole: 9.9823 -6.0974 -3.8850 9.2312 -0.1064 -0.0192
hfenergy: -598.7349824 hartree
pointgroup: C01 [X(C7H5F2N1O1)]
dipole: -1.2825023 1.4001277 0.0149865 debye
dipolederiv: -0.4706872 -0.30639 0.0012221 -0.2781708 -0.8319558 0.0015703 -0.0002009 0.0019377 -0.1499254 -0.274094 0.2176213 -0.0009435 0.2085153 -0.8386731 0.0020672 -0.0006754 0.0027557 -0.1188889 -0.7774294 0.290153 0.0034205 0.1030443 -0.8260741 -0.00785 -0.0009458 -0.0031848 -0.3585025 -0.702899 -0.4419598 -0.0030894 -0.3590138 -0.8461988 -0.0017333 -0.0026954 -0.0035182 -0.706993 -0.6478364 -0.0113809 0.0003279 0.1054489 -0.3352015 -0.0001177 0.0025696 -0.0003355 -0.0120241 0.6143672 0.3450952 -0.0012583 0.0768047 0.8968973 -0.0018996 -0.0015242 -0.0016108 0.0934081 0.4988535 -0.3292905 0.0010363 -0.0994997 0.9681872 -0.0030761 0.0020344 -0.0029259 0.1269684 -0.3371038 -0.2203634 0.0005953 -0.0726325 -0.1240491 0.0001259 0.0000234 -0.0000748 -0.166073 -0.2358769 0.2790687 -0.0008507 0.0638806 -0.1188662 -0.0001577 -0.0006217 -0.0003654 -0.1749445 0.1514846 -0.0063064 -0.0003732 0.0517306 0.2223807 -0.0009051 -0.0000196 -0.0006802 -0.120219 1.6029355 0.1215889 0.0000629 0.1744987 1.3426775 0.0151927 0.0008591 0.0108381 0.2701266 0.0711353 0.0432728 0.0000335 0.0488518 -0.0030275 0.0003265 -0.0001169 0.0001849 0.1896656 0.0673393 -0.0449015 0.0002453 -0.0551949 0.003757 0.0005373 0.0001648 0.0007442 0.1865117 -0.0699736 0.0053626 0.0002352 0.0037158 0.0968584 0.0001513 0.0003141 0.0001038 0.1619621 0.3192117 0.0190353 -0.000606 0.0028169 0.2110821 -0.0020862 0.0007871 -0.0018904 0.3977414 0.1905733 0.0393946 -0.0000581 0.0252043 0.1822059 -0.0021456 0.0000473 -0.0019783 0.3811865 unknown
polarizability: 114.3897254|-0.0885705|98.6051684|-0.0219761|0.0486787|35.0398895 unknown
InChI: InChI=1S/C7H5F2NO/c8-4-2-1-3-5(9)6(4)7(10)11/h1-3H,10H2
charge 0 multiplicity 1
16 atoms
F  0.222551 2.46164 -0.00746
F  0.055139 -2.428885 0.004107
O  2.408377 -1.213552 -0.013264
N  2.521033 1.088926 0.007776
C  0.290659 0.0071 -0.003618
C  -0.461038 1.212506 -0.004617
C  -0.526635 -1.161139 0.000243
C  -1.85859 1.30133 -0.003326
C  -1.93325 -1.137832 0.001846
C  -2.601936 0.101791 -0.000186
C  1.810412 -0.0977 -0.007481
H  -2.335297 2.284475 -0.004731
H  -2.473615 -2.087858 0.004931
H  -3.695124 0.135561 0.000963
H  2.075292 2.004233 0.015913
H  3.537124 1.002704 0.009604
