program: Gaussian 09
title: 000087427
version: EM64L-G09RevD.01
frameworkgroup: C1[X(C12H30O4Si2)]
method: RPBEPBE
basis: SDD
operation: Freq
keyword: #p
keyword: freq=noraman
keyword: PBEPBE/SDD
title: #p freq=noraman PBEPBE/SDD
converged: YES YES NO NO
title: Mulliken charges:
elementType: Si Si O O O O C C C C C C C C C C C C H H H H H H H H H H H H H H H H H H H H H H H H H H H H H H
charge: 1.490470 1.490420 -0.590492 -0.591983 -0.590429 -0.591999 -0.855818 -0.855878 -1.069456 -1.069511 -0.207940 -0.200493 -0.207942 -0.200474 -0.663959 -0.662443 -0.663930 -0.662445 0.254987 0.263169 0.255080 0.263170 0.258375 0.239075 0.255616 0.258437 0.239047 0.255581 0.204393 0.189523 0.193427 0.199589 0.189557 0.204370 0.193408 0.199593 0.224133 0.225667 0.197112 0.224414 0.225365 0.197263 0.224101 0.225694 0.197112 0.224424 0.225360 0.197263
chargesum: 0.00000
title: Mulliken charges with hydrogens summed into heavy atoms:
elementType: Si Si O O O O C C C C C C C C C C C C
charge: 1.490470 1.490420 -0.590492 -0.591983 -0.590429 -0.591999 -0.337662 -0.337629 -0.316390 -0.316446 0.185976 0.192523 0.185985 0.192528 -0.017047 -0.015401 -0.017023 -0.015399
polarizability: 2.21520908e+02 7.57971966e-03 1.88221738e+02 5.17983315e+00 3.58939958e-03 1.69601078e+02
1716.lowfreq: -3.3210 -0.0011 -0.0005 0.0006 5.1951 6.8052 13.0653 27.2401 28.9448
frequency: 13.0234 27.1653 28.4371 32.5722 34.9026 36.1304 47.3792 51.0095 57.5962 64.8273 68.4284 88.8211 91.8698 102.7706 103.2723 108.1765 110.7221 123.7366 124.3788 186.1701 188.6331 207.6635 210.5766 213.0826 243.8788 247.3341 248.0963 249.4819 275.2633 283.7404 284.8007 322.2229 331.1789 379.1123 385.4799 395.1545 429.2174 582.9378 602.1171 659.9840 673.5133 682.0177 695.9712 712.0454 742.1109 799.0985 805.9626 806.0039 806.4670 807.2022 832.1080 854.9702 855.5500 870.2399 901.6290 931.8020 932.1142 936.5190 937.0106 1011.4127 1054.1117 1059.3276 1062.7322 1070.9581 1080.7600 1102.1993 1102.9855 1103.2687 1103.8832 1135.1823 1135.3158 1135.5465 1137.0075 1188.8382 1260.7991 1261.5118 1262.9208 1264.7351 1267.9317 1279.0184 1310.5391 1310.6384 1362.0994 1363.1675 1364.5053 1365.2286 1389.8959 1390.1688 1390.5935 1390.6333 1436.4904 1439.8229 1443.1550 1444.8641 1450.2394 1450.8028 1456.7807 1456.7995 1457.3414 1457.6029 1475.3396 1477.1396 1478.1310 1478.6169 1489.9889 1490.0351 1492.8476 1493.1101 2930.5127 2930.8061 2939.8084 2939.9410 2980.3569 2986.1017 2986.7887 2987.7563 2988.0829 2988.1517 2988.2037 2988.5689 2991.9520 2992.0000 2993.8022 2993.8453 3031.4106 3052.1427 3085.3822 3085.4167 3085.4913 3085.7984 3097.1525 3097.1767 3099.4293 3099.4930 3099.7298 3099.8696 3100.1027 3100.1310
redmass: 3.8628 3.4480 3.2181 3.0311 3.1700 3.5586 1.9946 2.0221 1.8242 1.9657 3.8682 2.6306 2.3641 1.1762 1.1190 2.0480 2.7389 4.0738 3.6997 2.0822 4.8894 2.3815 2.4983 2.7572 1.3930 1.4931 1.2398 1.2098 3.3295 3.0431 3.0306 3.4862 4.3712 4.1775 3.6504 3.7089 4.3467 4.4689 4.1216 2.1767 3.8558 2.4253 3.9647 2.3739 2.7601 3.5704 1.0905 1.0913 1.0916 1.0938 1.9228 1.4676 1.4538 1.5703 1.6713 2.6679 2.6427 2.8461 2.7150 3.8280 4.2449 4.5011 4.3296 4.7015 1.0821 2.1271 2.1022 2.1535 2.1262 1.4670 1.4661 1.4720 1.4745 1.2308 1.1322 1.1299 1.1281 1.1271 1.1354 1.4029 1.2065 1.2053 1.2543 1.2537 1.2411 1.2407 1.2577 1.2587 1.2591 1.2594 1.0593 1.0513 1.0892 1.0561 1.0500 1.0506 1.0417 1.0417 1.0415 1.0414 1.0506 1.0496 1.0466 1.0450 1.0788 1.0794 1.0825 1.0829 1.0575 1.0579 1.0558 1.0558 1.0610 1.1011 1.0914 1.0595 1.0380 1.0383 1.0363 1.0447 1.0939 1.0937 1.0462 1.0462 1.0985 1.0995 1.0985 1.0985 1.0985 1.0985 1.0977 1.0976 1.0987 1.0988 1.1012 1.1011 1.1012 1.1012
irintensity: 0.0039 0.1635 0.1123 0.0081 0.0850 0.0434 0.0645 0.3911 0.3860 3.7055 0.1777 8.3212 4.9148 0.6780 0.4202 1.7969 1.4719 0.5546 12.5762 1.9624 0.9449 2.2293 0.3273 5.7441 0.8394 0.0905 0.9191 2.4986 12.5966 19.5222 12.3313 7.9170 50.2860 5.4048 10.9819 16.8741 1.3985 2.8615 1.2007 3.0240 48.4520 0.2451 47.7331 62.9583 45.1732 59.1232 2.5056 3.1643 0.1178 4.6118 166.6820 2.1693 132.7801 40.4147 19.0392 179.2498 147.2157 151.1512 29.1456 0.6558 197.2066 223.2220 359.1170 199.5916 29.0530 4.2914 7.1111 23.3284 6.2591 2.1183 7.7060 8.9887 0.1414 73.0699 0.7648 1.4653 1.9590 0.0084 0.2628 0.1848 56.1710 59.8470 6.6354 14.6344 17.2687 5.1022 11.5792 30.0782 51.3806 24.0036 0.6577 9.2332 29.3991 0.0712 16.1870 5.9566 1.2937 19.1759 19.2419 0.7579 5.2393 15.8816 1.0197 4.6031 3.6122 9.4096 0.0880 0.4266 20.7294 111.9062 124.0309 2.2102 0.0300 113.9621 8.7683 11.9195 36.7640 4.6465 29.1767 31.8837 7.1109 57.3030 7.1434 37.2446 0.6577 23.3094 49.3198 1.0550 67.2983 35.6232 23.0789 1.2343 10.0758 3.6541 59.2063 32.3786 56.5663 28.0680
temp: 298.150 k
press: 1.00000 atm
elementType: 14 14 8 8 8 8 6 6 6 6 6 6 6 6 6 6 6 6 1 1 1 1 1 1 1 1 1 1 1 1 1 1 1 1 1 1 1 1 1 1 1 1 1 1 1 1 1 1
symmnumber: 1
zpe: 1069079.3 jmol-1
zpe.correction: 0.407191 hartree
zpe.thermalcorrener: 0.435846 hartree
zpe.thermalcorrenthalpy: 0.436790 hartree
zpe.thermalcorrgfe: 0.342345 hartree
zpe.sumelectzpe: -1353.545959 hartree
zpe.sumelectthermal: -1353.517304 hartree
zpe.sumelectthermalent: -1353.516360 hartree
zpe.sumelectthermalfe: -1353.610805 hartree
dipole: 0.0005 0.0264 0.0003
dipole: 0.0264
quadrupole: -115.2059 -118.8143 -136.4393
quadrupole: 0.0003 -0.3839 0.0111
quadrupole: 8.2806 4.6722 -12.9528 0.0003 -0.3839 0.0111
hfenergy: -1353.9531499 hartree
pointgroup: C01 [X(C12H30O4Si2)]
dipole: -0.0001744 -0.0104029 0.0001309 debye
polarizability: 221.6221998|0.0296023|188.2217616|-4.6432752|-0.0097121|169.4997629 unknown
InChI: InChI=1S/C12H30O4Si2/c1-7-13-17(5,14-8-2)11-12-18(6,15-9-3)16-10-4/h7-12H2,1-6H3
charge 0 multiplicity 1
48 atoms
Si 2.255651 0.776707 0.522604
Si -2.254049 0.772272 -0.523372
O  2.31193 -0.729219 1.398986
O  3.489441 0.803749 -0.705061
O  -2.310439 -0.735065 -1.397344
O  -3.488283 0.801724 0.703776
C  0.631289 0.927185 -0.456561
C  -0.630043 0.924277 0.456147
C  2.536579 2.075798 1.869242
C  -2.533963 2.069066 -1.872453
C  2.145771 -2.050539 0.783364
C  4.934237 0.753086 -0.447114
C  -2.145389 -2.055534 -0.779507
C  -4.933019 0.750965 0.44541
C  2.367392 -3.110109 1.864526
C  5.657635 0.769214 -1.794885
C  -2.370337 -3.116723 -1.858402
C  -5.656898 0.770388 1.792874
H  0.675074 1.85014 -1.067112
H  0.593269 0.090044 -1.182724
H  -0.676397 1.845449 1.069186
H  -0.589596 0.085327 1.180103
H  1.720182 2.044951 2.612324
H  2.580563 3.092889 1.440817
H  3.481419 1.882273 2.407237
H  -1.718477 2.034782 -2.616385
H  -2.57528 3.087207 -1.446259
H  -3.479828 1.87641 -2.40896
H  2.871149 -2.176165 -0.047748
H  1.123173 -2.142183 0.354417
H  5.238949 1.626588 0.168571
H  5.183955 -0.167191 0.121953
H  -1.122213 -2.14789 -0.352141
H  -2.869607 -2.178552 0.053006
H  -5.23721 1.623155 -0.172385
H  -5.1828 -0.170535 -0.121644
H  3.384978 -3.022171 2.282886
H  1.644578 -2.973652 2.687449
H  2.242348 -4.126971 1.446803
H  5.355037 -0.101251 -2.402398
H  5.402104 1.685206 -2.355216
H  6.754023 0.736491 -1.649932
H  -3.388548 -3.02822 -2.275117
H  -1.648794 -2.982602 -2.682818
H  -2.245828 -4.133013 -1.439125
H  -5.35468 -0.098718 2.402515
H  -5.401407 1.687633 2.351171
H  -6.75324 0.737528 1.647597
